Cycloheptane, bromo-
- Formula: C7H13Br
- Molecular weight: 177.082
- IUPAC Standard InChIKey: LOXORFRCPXUORP-UHFFFAOYSA-N
- CAS Registry Number: 2404-35-5
- Chemical structure:
View 3d structure (requires JavaScript / HTML 5) - Other names: Bromocycloheptane; Cycloheptyl bromide

Phase change data

Data compiled by: Robert L. Brown and Stephen E. Stein
Reduced pressure boiling point
Tboil (K) | Pressure (bar) | Reference |
---|---|---|
344.7 | 0.013 | Aldrich Chemical Company Inc., 1990 |
356. | 0.020 | Buckingham and Donaghy, 1982 |

Kovats' RI, non-polar column, isothermal

Column type | Active phase | Temperature (C) | I | Reference | Comment |
---|---|---|---|---|---|
Packed | Apiezon L | 130. | 1157. | Wehrli and Kováts, 1959 | Celite; Column length: 2.25 m |

Normal alkane RI, non-polar column, custom temperature program

Column type | Active phase | I | Reference | Comment |
---|---|---|---|---|
Capillary | Methyl Silicone | 1157. | N/A | Program: not specified |

References

Aldrich Chemical Company Inc., 1990
Aldrich Chemical Company Inc.,
Catalog Handbook of Fine Chemicals, Aldrich Chemical Company, Inc., Milwaukee WI, 1990, 1. [all data]
Buckingham and Donaghy, 1982
Buckingham, J.; Donaghy, S.M.,
Dictionary of Organic Compounds: Fifth Edition, Chapman and Hall, New York, 1982, 1. [all data]
Wehrli and Kováts, 1959
Wehrli, A.; Kováts, E.,
Gas-chromatographische Charakterisierung ogranischer Verbindungen. Teil 3: Berechnung der Retentionsindices aliphatischer, alicyclischer und aromatischer Verbindungen,
Helv. Chim. Acta, 1959, 7, 7, 2709-2736, https://doi.org/10.1002/hlca.19590420745
. [all data]