Bicyclo[3.1.1]heptan-3-ol, 2,6,6-trimethyl-, [1S-(1α,2β,3α,5α)]-
- Formula: C10H18O
- Molecular weight: 154.2493
- IUPAC Standard InChIKey: NJBQFUAXCUCPGX-LUTQBAROSA-N
- CAS Registry Number: 24041-60-9
- Chemical structure:
View 3d structure (requires JavaScript / HTML 5) - Other names: (+)-Isopinocampheol; [1S-(1α,2β,3α,5α)]-2,6,6-trimethylbicyclo[3.1.1]heptan-3-ol

Gas phase thermochemistry data

Data compiled by: Hussein Y. Afeefy, Joel F. Liebman, and Stephen E. Stein
Quantity | Value | Units | Method | Reference | Comment |
---|---|---|---|---|---|
ΔfH°gas | -182. ± 8.4 | kJ/mol | Ccb | Steele, 1979 |

References

Steele, 1979
Steele, W.V.,
Thermochemically determined ΔH°f(g) values for ketones and alcohols,
Private Communication, University of Stirling, Stirling, Scotland, 1979, 0. [all data]