N,N-Dimethyl O,O'-diethyl phosphoramidate
- Formula: C6H16NO3P
- Molecular weight: 181.1699
- IUPAC Standard InChIKey: MSDFSXFZUKFPKX-UHFFFAOYSA-N
- CAS Registry Number: 2404-03-7
- Chemical structure:
View 3d structure (requires JavaScript / HTML 5) - Other names: Diethyl dimethylphosphoramidate; Diethyl N,N-dimethylphosphoramidate

Van Den Dool and Kratz RI, non-polar column, temperature ramp

Column type | Active phase | I | Reference | Comment |
---|---|---|---|---|
Capillary | OV-1 | 1097. | Kostiainen, 2000 | 15. m/0.32 mm/0.25 μm, He, 50. C @ 2. min, 10. K/min, 280. C @ 10. min |
Capillary | SE-54 | 1134. | Kostiainen, 2000 | 25. m/0.32 mm/0.25 μm, He, 40. C @ 1. min, 10. K/min, 280. C @ 10. min |
Capillary | SE-54 | 1145.2 | Kostiainen, 2000 | 25. m/0.32 mm/0.25 μm, He, 40. C @ 1. min, 10. K/min, 280. C @ 10. min |

Normal alkane RI, non-polar column, temperature ramp

Column type | Active phase | I | Reference | Comment |
---|---|---|---|---|
Capillary | DB-1 | 1096.6 | D'Agostino, Hansen, et al., 1985 | 15. m/0.32 mm/0.25 μm, He, 50. C @ 2. min, 10. K/min; Tend: 300. C |
Capillary | DB-5 | 1145.2 | D'Agostino, Hansen, et al., 1985 | 15. m/0.32 mm/0.25 μm, He, 50. C @ 2. min, 10. K/min; Tend: 300. C |

Normal alkane RI, non-polar column, custom temperature program

Column type | Active phase | I | Reference | Comment |
---|---|---|---|---|
Capillary | 5 % Phenyl methyl siloxane | 1134. | OPCW, 1997 | Program: not specified |

References

Kostiainen, 2000
Kostiainen, O.,
Gas Chromatography in Screening of Chemicals Related to the Chemical Weapons Convention
in Encyclopedia of Analytical Chemistry, Meyers, R.A., ed(s)., John Wiley Sons Ltd, Chichester, 2000, 963-979. [all data]
D'Agostino, Hansen, et al., 1985
D'Agostino, P.A.; Hansen, A.S.; Lockwood, P.A.; Provost, L.R.,
Capillary Column Gas Chromatography-Mass Spectrometry of Tabun,
J. Chromatogr., 1985, 347, 257-266, https://doi.org/10.1016/S0021-9673(01)95491-3
. [all data]
OPCW, 1997
OPCW,
Conference of the States Parties C-I/DEC.64 (22 May 1997), 1997, retrieved from http://www.opcw.org/html/global/cseries/csp1/CIDEC64.html. [all data]