N-[2-(1-piperazinyl)ethyl]ethylenediamine
- Formula: C8H20N4
- Molecular weight: 172.2712
- IUPAC Standard InChIKey: WBIWIXJUBVWKLS-UHFFFAOYSA-N
- CAS Registry Number: 24028-46-4
- Chemical structure:
View 3d structure (requires JavaScript / HTML 5) - Other names: N-[(2-Aminoethyl)2-aminoethyl]piperazine

Condensed phase thermochemistry data

Data compiled by: Eugene S. Domalski and Elizabeth D. Hearing
Constant pressure heat capacity of liquid
Cp,liquid (J/mol*K) | Temperature (K) | Reference | Comment |
---|---|---|---|
391. | 333. | Bobylev, Kamskaya, et al., 1988 | T = 333 to 473 K. |

Reaction thermochemistry data

Data compiled by: Hussein Y. Afeefy, Joel F. Liebman, and Stephen E. Stein
Individual Reactions
By formula: C6H15N3 + C2H5N = C8H20N4
Quantity | Value | Units | Method | Reference | Comment |
---|---|---|---|---|---|
ΔrH° | 87. ± 4. | kJ/mol | Cm | Dalin, Bobylev, et al., 1988 | liquid phase; solvent: Aqueous HCl; Kinetic |

References

Bobylev, Kamskaya, et al., 1988
Bobylev, V.A.; Kamskaya, O.I.; Kossoi, A.A.; Koludarova, E.Yu.,
Investigation of the heat capacity of ethyleneamines by differential scanning calorimetry,
Zhur. Obshch. Khim., 1988, 58, 2536-2538. [all data]
Dalin, Bobylev, et al., 1988
Dalin, A.R.; Bobylev, V.A.; Suslikov, V.F.; Kamskaya, O.I.; Tereshchenko, G.F.,
Nucleophilic cleavage and the formation of saturated heterocycles. VII. Kinetic and thermochemical study of reactions of aziridine with ethylene amines,
J. Gen. Chem. USSR, 1988, 58, 1868-1871. [all data]