bis(triisopropylgermyl)mercury
- Formula: C18H42Ge2Hg
- Molecular weight: 604.40
- CAS Registry Number: 24004-54-4

Phase change data

Data compiled by: William E. Acree, Jr., James S. Chickos
Enthalpy of vaporization
ΔvapH (kcal/mol) | Temperature (K) | Reference | Comment |
---|---|---|---|
16.4 | 388. | Bragin, Karapet'yants, et al., 1972 | Based on data from 373. to 483. K. |
16.4 | 388. | Bragin, Karapet'yants, et al., 1972 | Based on data from 373. to 483. K. |

References

Bragin, Karapet'yants, et al., 1972
Bragin, G.P.; Karapet'yants, M.Kh.; Goncharov, A.K.; Kol'yakova, G.M.,
Tr. Mosk. Khim. Tekhnol. Inst., 1972, 71, 10. [all data]