cis-Cyclobutane-1,3-dicarboxylic acid

Condensed phase thermochemistry data

Data compiled by: Hussein Y. Afeefy, Joel F. Liebman, and Stephen E. Stein

Quantity Value Units Method Reference Comment
Δfsolid-200.3 ± 0.96kcal/molCcbGutner, Ryadnenko, et al., 1984Hf(liq)=-828.9±4.1
Quantity Value Units Method Reference Comment
Δcsolid-637.26 ± 0.96kcal/molCcbGutner, Ryadnenko, et al., 1984Hf(liq)=-828.9±4.1; Corresponding Δfsolid = -200.3 kcal/mol (simple calculation by NIST; no Washburn corrections)

Phase change data

Data compiled by: Robert L. Brown and Stephen E. Stein

Quantity Value Units Method Reference Comment
Tboil525.2KN/AWeast and Grasselli, 1989

References

Gutner, Ryadnenko, et al., 1984
Gutner, N.M.; Ryadnenko, V.L.; Karpenko, N.A.; Makhinya, E.F.; Kiseleva, N.N., Standard enthalpies of formation of some cyclic derivatives, Probl. Kalorim. Khim. Termodin., Dokl. Vses. Konf., 10th, 1984, 1, 196-198. [all data]

Weast and Grasselli, 1989
CRC Handbook of Data on Organic Compounds, 2nd Editon, Weast,R.C and Grasselli, J.G., ed(s)., CRC Press, Inc., Boca Raton, FL, 1989, 1. [all data]