3-Hexenoic acid, ethyl ester
- Formula: C8H14O2
- Molecular weight: 142.1956
- IUPAC Standard InChIKey: VTSFIPHRNAESED-AATRIKPKSA-N
- CAS Registry Number: 2396-83-0
- Chemical structure:
View 3d structure (requires JavaScript / HTML 5) - Species with the same structure:
- Stereoisomers:
- Other names: Ethyl 3-hexenoate; Ethyl hex-3-enoate

Phase change data

Data compiled by: Robert L. Brown and Stephen E. Stein
Reduced pressure boiling point
Tboil (K) | Pressure (bar) | Reference |
---|---|---|
337.2 | 0.016 | Weast and Grasselli, 1989 |

Van Den Dool and Kratz RI, polar column, custom temperature program

Column type | Active phase | I | Reference | Comment |
---|---|---|---|---|
Capillary | DB-Wax | 1290. | Ferrari, Lablanquie, et al., 2004 | 60. m/0.25 mm/0.25 μm, He; Program: 35C(0.7min) => 20C/min => 70C => 4C/min => 240C |

Normal alkane RI, non-polar column, temperature ramp

Column type | Active phase | I | Reference | Comment |
---|---|---|---|---|
Capillary | DB-5 | 1003. | El-Sayed, Heppelthwaite, et al., 2005 | 30. m/0.25 mm/0.25 μm, 40. C @ 2. min, 4. K/min; Tend: 240. C |
Capillary | DB-5 | 1007. | Woerdenbag, Windono, et al., 2004 | 30. m/0.249 mm/0.25 μm, He, 3. K/min; Tstart: 60. C; Tend: 300. C |
Capillary | DB-1 | 986. | Peppard, 1992 | 30. m/0.25 mm/1.0 μm, He, 3. K/min, 250. C @ 30. min; Tstart: 40. C |
Capillary | DB-1 | 987. | Peppard, 1992 | 30. m/0.25 mm/1.0 μm, He, 3. K/min, 250. C @ 30. min; Tstart: 40. C |
Capillary | OV-1 | 984. | Schreyen, Dirinck, et al., 1979 | N2, 1. K/min; Column length: 183. m; Column diameter: 0.762 mm; Tstart: 0. C; Tend: 230. C |

References

Weast and Grasselli, 1989
CRC Handbook of Data on Organic Compounds, 2nd Editon, Weast,R.C and Grasselli, J.G., ed(s)., CRC Press, Inc., Boca Raton, FL, 1989, 1. [all data]
Ferrari, Lablanquie, et al., 2004
Ferrari, G.; Lablanquie, O.; Cantagrel, R.; Ledauphin, J.; Payot, T.; Fournier, N.; Guichard, E.,
Determination of key odorant compounds in freshly distilled cognac using GC-O, GC-MS, and sensory evaluation,
J. Agric. Food Chem., 2004, 52, 18, 5670-5676, https://doi.org/10.1021/jf049512d
. [all data]
El-Sayed, Heppelthwaite, et al., 2005
El-Sayed, A.M.; Heppelthwaite, V.J.; Manning, L.M.; Gibb, A.R.; Suckling, D.M.,
Volatile constituents of fermented sugar baits and their attraction to lepidopteran species,
J. Agric. Food Chem., 2005, 53, 4, 953-958, https://doi.org/10.1021/jf048521j
. [all data]
Woerdenbag, Windono, et al., 2004
Woerdenbag, H.J.; Windono, T.; Bos, R.; Riswan, S.; Quax, W.J.,
Composition of the essential oils of Kaempferia rotunda L. and Kaempferia angustifolia Roscoe rhizomes from Indonesia,
Flavour Fragr. J., 2004, 19, 2, 145-148, https://doi.org/10.1002/ffj.1284
. [all data]
Peppard, 1992
Peppard, T.L.,
Volatile flavor constituents of Monstera deliciosa,
J. Agric. Food Chem., 1992, 40, 2, 257-262, https://doi.org/10.1021/jf00014a018
. [all data]
Schreyen, Dirinck, et al., 1979
Schreyen, L.; Dirinck, P.; Sandra, P.; Schamp, N.,
Flavor analysis of quince,
J. Agric. Food Chem., 1979, 27, 4, 872-876, https://doi.org/10.1021/jf60224a058
. [all data]