Diazene, (4-methoxyphenyl)phenyl-
- Formula: C13H12N2O
- Molecular weight: 212.2472
- IUPAC Standard InChIKey: LGCRPKOHRIXSEG-UHFFFAOYSA-N
- CAS Registry Number: 2396-60-3
- Chemical structure:
View 3d structure (requires JavaScript / HTML 5) - Stereoisomers:
- Other names: Azobenzene, 4-methoxy-; p-Methoxyazobenzene; 4-Methoxyazobenzene; p-Phenylazoanisole; Anisole, p-(phenylazo)-

Phase change data

Data compiled by: Robert L. Brown and Stephen E. Stein
Quantity | Value | Units | Method | Reference | Comment |
---|---|---|---|---|---|
Tboil | 613.2 | K | N/A | Weast and Grasselli, 1989 |

Condensed phase thermochemistry data

Data compiled by: Hussein Y. Afeefy, Joel F. Liebman, and Stephen E. Stein
Quantity | Value | Units | Method | Reference | Comment |
---|---|---|---|---|---|
ΔfH°solid | 43.9 | kcal/mol | Ccb | Lemoult, 1908 | |
Quantity | Value | Units | Method | Reference | Comment |
ΔcH°solid | -1676.5 | kcal/mol | Ccb | Lemoult, 1908 |

References

Weast and Grasselli, 1989
CRC Handbook of Data on Organic Compounds, 2nd Editon, Weast,R.C and Grasselli, J.G., ed(s)., CRC Press, Inc., Boca Raton, FL, 1989, 1. [all data]