1,3,5-Trioxane, 2,4,6-tripropyl-
- Formula: C12H24O3
- Molecular weight: 216.3172
- IUPAC Standard InChIKey: OXSRKPVVVMMMER-UHFFFAOYSA-N
- CAS Registry Number: 2396-43-2
- Chemical structure:
View 3d structure (requires JavaScript / HTML 5) - Other names: s-Trioxane, 2,4,6-tripropyl-; Parabutyraldehyde; 2,4,6-Tripropyl-s-trioxane; p-n-Butyraldehyde; 2,4,6-tripropyl-1,3,5-trioxane

Reaction thermochemistry data

Data compiled by: Hussein Y. Afeefy, Joel F. Liebman, and Stephen E. Stein
Individual Reactions
By formula: 3C4H8O = C12H24O3
Quantity | Value | Units | Method | Reference | Comment |
---|---|---|---|---|---|
ΔrH° | -29.45 | kJ/mol | Eqk | Ogorodnikov, Katsnel'son, et al., 1990 | liquid phase; PMR |
By formula: 3C4H8O = C12H24O3
Quantity | Value | Units | Method | Reference | Comment |
---|---|---|---|---|---|
ΔrH° | -28.47 | kJ/mol | Eqk | Ogorodnikov, Katsnel'son, et al., 1990 | liquid phase; PMR |

References

Ogorodnikov, Katsnel'son, et al., 1990
Ogorodnikov, A.L.; Katsnel'son, M.G.; Pinson, V.V.; Levin, Yu.V.,
Study of thermodynamic characteristics of a butyraldehyde-cyclic trimer system,
Zh. Prikl. Khim. (Leningrad), 1990, 63, 1340-1343. [all data]