Ethirimol
- Formula: C11H19N3O
- Molecular weight: 209.2881
- IUPAC Standard InChIKey: BBXXLROWFHWFQY-UHFFFAOYSA-N
- CAS Registry Number: 23947-60-6
- Chemical structure:
View 3d structure (requires JavaScript / HTML 5) - Other names: 4(1H)-Pyrimidinone, 5-butyl-2-(ethylamino)-6-methyl-; 4(3H)-Pyrimidinone, 5-butyl-2-(ethylamino)-6-methyl-; Ethirimal; Ethrimiol; Milgo; Milgo E; Milstem; PP 149; 5-Butyl-2-(ethylamino)-4-hydroxy-6-methylpyrimidine; 5-n-Butyl-2-ethylamino-4-hydroxy-6-methylpyrimidine; 5-Butyl-2-(ethylamino)-6-methyl-4(1H)-pyrimidinone; 2-Ethylamino-4-methyl-5-n-butyl-6-hydroxypyrimidine; Ethyrimol; Milstem seed dressing; New milstem; NSC 263491; 5-Butyl-2-ethylamino-6-methylpyrimidin-4-ol

Phase change data

Data compiled as indicated in comments:
TRC - Thermodynamics Research Center, NIST Boulder Laboratories, Chris Muzny director
AC - William E. Acree, Jr., James S. Chickos
Quantity | Value | Units | Method | Reference | Comment |
---|---|---|---|---|---|
Tfus | 434.35 | K | N/A | Donnelly, Drewes, et al., 1990 | Uncertainty assigned by TRC = 0.2 K; TRC |
Enthalpy of fusion
ΔfusH (kcal/mol) | Temperature (K) | Method | Reference | Comment |
---|---|---|---|---|
4.857 | 432.5 | DSC | Acree, 1991 | See also Donnelly, Drewes, et al., 1990, 2.; AC |

References

Donnelly, Drewes, et al., 1990
Donnelly, J.R.; Drewes, L.A.; Johnson, R.L.; Munslow, W.D.; Knapp, K.K.; Sovocool, G.W.,
Purity and heat of fusion data for environmental standards as determined by differential scanning calorimetry,
Thermochim. Acta, 1990, 167, 2, 155, https://doi.org/10.1016/0040-6031(90)80476-F
. [all data]
Acree, 1991
Acree, William E.,
Thermodynamic properties of organic compounds: enthalpy of fusion and melting point temperature compilation,
Thermochimica Acta, 1991, 189, 1, 37-56, https://doi.org/10.1016/0040-6031(91)87098-H
. [all data]
Donnelly, Drewes, et al., 1990, 2
Donnelly, J.R.; Drewes, L.A.; Johnson, R.L.; Munslow, W.D.; Knapp, K.K.; Sovocool, G.W.,
Purity and heat of fusion data for environmental standards as determined by differential scanning calorimetry,
Thermochimica Acta, 1990, 167, 2, 155-187, https://doi.org/10.1016/0040-6031(90)80476-F
. [all data]