trans-2,5-dimethyltetrahydrofuran
- Formula: C6H12O
- Molecular weight: 100.1589
- IUPAC Standard InChIKey: OXMIDRBAFOEOQT-WDSKDSINSA-N
- CAS Registry Number: 2390-94-5
- Chemical structure:
View 3d structure (requires JavaScript / HTML 5) - Stereoisomers:

Phase change data

Data compiled by: Thermodynamics Research Center, NIST Boulder Laboratories, Chris Muzny director
Quantity | Value | Units | Method | Reference | Comment |
---|---|---|---|---|---|
Tboil | 367.15 | K | N/A | Gagnaire and Monzeglio, 1965 | Uncertainty assigned by TRC = 1. K |

References

Gagnaire and Monzeglio, 1965
Gagnaire, D.; Monzeglio, P.,
Stereochemical Studies in the Tetraahydrofuran Series V. Configuration of Symmetrical Substituted Dihydrofuran and Tetrahydrofuran,
Bull. Soc. Chim. Fr., 1965, 1965, 474. [all data]