Glycyl-L-tryptophan
- Formula: C13H15N2O3
- Molecular weight: 247.2698
- IUPAC Standard InChIKey: AJHCSUXXECOXOY-LLVKDONJSA-N
- CAS Registry Number: 2390-74-1
- Chemical structure:
View 3d structure (requires JavaScript / HTML 5) - Other names: L-Tryptophan, N-glycyl-; Tryptophan, N-glycyl-, l-; Glycyltryptophan; l-Glycyltryptophan; N-Glycyl-l-tryptophan; N-Glycyltryptophan; Nα-Glycyl-l-tryptophan; Tryptophan, N-(aminomethylcarbonyl)-; N-(Aminoacetyl)tryptophan, (L)-; L-Tryptophan, glycyl-; α-glycyltryptophan

Reaction thermochemistry data

Data compiled by: Robert C. Dunbar
Individual Reactions
By formula: Na+ + C13H15N2O3 = (Na+ • C13H15N2O3)
Free energy of reaction
ΔrG° (kJ/mol) | T (K) | Method | Reference |
---|---|---|---|
172. | 0. | CIDC | Feng, Gronert, et al., 1999 |

Ion clustering data

Data compiled by: Robert C. Dunbar
Clustering reactions
By formula: Na+ + C13H15N2O3 = (Na+ • C13H15N2O3)
Free energy of reaction
ΔrG° (kJ/mol) | T (K) | Method | Reference |
---|---|---|---|
172. | 0. | CIDC | Feng, Gronert, et al., 1999 |

References

Feng, Gronert, et al., 1999
Feng, W.Y.; Gronert, S.; Lebrilla, C.B.,
Lithium and sodium ion binding energies of N-acetyl and N-glycyl amino acids,
J. Am. Chem. Soc., 1999, 121, 6, 1365, https://doi.org/10.1021/ja983116s
. [all data]