6-Octenal, 3,7-dimethyl-, (R)-
- Formula: C10H18O
- Molecular weight: 154.2493
- IUPAC Standard InChIKey: NEHNMFOYXAPHSD-JTQLQIEISA-N
- CAS Registry Number: 2385-77-5
- Chemical structure:
View 3d structure (requires JavaScript / HTML 5) - Stereoisomers:
- Other names: (R)-(+)-Citronellal; 3,7-Dimethyl-6-octenal, (3R)-; (3R)-(+)-Citronellal; (R)-3,7-Dimethyloct-6-enal

Phase change data

Data compiled as indicated in comments:
BS - Robert L. Brown and Stephen E. Stein
AC - William E. Acree, Jr., James S. Chickos
Quantity | Value | Units | Method | Reference | Comment |
---|---|---|---|---|---|
Tboil | 481.0 | K | N/A | Weast and Grasselli, 1989 | BS |
Enthalpy of vaporization
ΔvapH (kJ/mol) | Temperature (K) | Method | Reference | Comment |
---|---|---|---|---|
54.9 | 303. | A | Stephenson and Malanowski, 1987 | Based on data from 288. to 333. K.; AC |
53.2 | 332. | A | Stephenson and Malanowski, 1987 | Based on data from 317. to 480. K. See also Stull, 1947.; AC |

References

Weast and Grasselli, 1989
CRC Handbook of Data on Organic Compounds, 2nd Editon, Weast,R.C and Grasselli, J.G., ed(s)., CRC Press, Inc., Boca Raton, FL, 1989, 1. [all data]
Stephenson and Malanowski, 1987
Stephenson, Richard M.; Malanowski, Stanislaw,
Handbook of the Thermodynamics of Organic Compounds, 1987, https://doi.org/10.1007/978-94-009-3173-2
. [all data]
Stull, 1947
Stull, Daniel R.,
Vapor Pressure of Pure Substances. Organic and Inorganic Compounds,
Ind. Eng. Chem., 1947, 39, 4, 517-540, https://doi.org/10.1021/ie50448a022
. [all data]