Oxirane, (2-methylpropyl)-
- Formula: C6H12O
- Molecular weight: 100.1589
- IUPAC Standard InChIKey: YXIOECOAAMLHPG-UHFFFAOYSA-N
- CAS Registry Number: 23850-78-4
- Chemical structure:
View 3d structure (requires JavaScript / HTML 5) - Other names: Pentane, 1,2-epoxy-4-methyl-; 1,2-Epoxy-4-methylpentane; 2-Isobutyloxirane; 4-Methyl-1,2-epoxypentane; Isobutyloxirane

Kovats' RI, non-polar column, isothermal

Column type | Active phase | Temperature (C) | I | Reference | Comment |
---|---|---|---|---|---|
Capillary | OV-101 | 60. | 751.2 | Boneva and Dimov, 1986 | 100. m/0.27 mm/0.9 μm, N2 |
Capillary | OV-101 | 70. | 751.8 | Boneva and Dimov, 1986 | 100. m/0.27 mm/0.9 μm, N2 |
Capillary | OV-101 | 70. | 753.4 | Boneva and Dimov, 1986 | 100. m/0.27 mm/0.9 μm, N2 |
Capillary | OV-101 | 90. | 753.4 | Boneva and Dimov, 1986 | 100. m/0.27 mm/0.9 μm, N2 |

Normal alkane RI, non-polar column, temperature ramp

Column type | Active phase | I | Reference | Comment |
---|---|---|---|---|
Capillary | OV-101 | 721. | Zenkevich, 2005 | 25. m/0.20 mm/0.10 μm, N2/He, 6. K/min; Tstart: 50. C; Tend: 250. C |

References

Boneva and Dimov, 1986
Boneva, S.; Dimov, N.,
Gas chromatographic separation of C6 epoxides on OV-101 glass capillary column; pre-calculation of the retention index,
Chromatographia, 1986, 22, 7-12, 271-274, https://doi.org/10.1007/BF02268772
. [all data]
Zenkevich, 2005
Zenkevich, I.G.,
Experimentally measured retention indices., 2005. [all data]