Phosphinidene anion
- Formula: HP-
- Molecular weight: 31.98225
- CAS Registry Number: 23841-34-1

Reaction thermochemistry data

Data compiled by: John E. Bartmess
Individual Reactions
By formula: (HP- • 4294967295P) + P = HP-
Quantity | Value | Units | Method | Reference | Comment |
---|---|---|---|---|---|
ΔrH° | 325. ± 35. | kJ/mol | N/A | Ervin and Lineberger, 2005 | gas phase |
ΔrH° | 325. ± 34. | kJ/mol | Ther | Zittel and Lineberger, 1976 | gas phase |

Ion clustering data

Data compiled by: John E. Bartmess

Clustering reactions

(HP- • 4294967295phosphorus) + phosphorus = HP-

By formula: (HP- • 4294967295P) + P = HP-

Quantity Value Units Method Reference Comment
Δr325. ± 35.kJ/molN/AErvin and Lineberger, 2005gas phase
Δr325. ± 34.kJ/molTherZittel and Lineberger, 1976gas phase

References

Ervin and Lineberger, 2005
Ervin, K.M.; Lineberger, W.C.,
Photoelectron spectroscopy of phosphorus hydride anions,
J. Chem. Phys., 2005, 122, 19, 194303, https://doi.org/10.1063/1.1881153
. [all data]
Zittel and Lineberger, 1976
Zittel, P.F.; Lineberger, W.C.,
Laser photoelectron spectrometry of PO-, PH-, and PH2-,
J. Chem. Phys., 1976, 65, 1236. [all data]