Naphtho[1,2-k]fluoranthene
- Formula: C24H14
- Molecular weight: 302.3680
- IUPAC Standard InChIKey: TUNJIKOIQLBFSB-UHFFFAOYSA-N
- CAS Registry Number: 238-04-0
- Chemical structure:
View 3d structure (requires JavaScript / HTML 5) - Permanent link for this species. Use this link for bookmarking this species for future reference.

Lee's RI, non-polar column, temperature ramp

Column type | Active phase | I | Reference | Comment |
---|---|---|---|---|
Capillary | HP-5 | 536.5 | Marynowski, Pieta, et al., 2004 | 60. m/0.25 mm/0.25 μm, He, 3. K/min; Tstart: 35. C; Tend: 300. C |
Capillary | DB-5MS | 540.4 | Sauvain and Duc, 2004 | 30. m/0.25 mm/0.25 μm, 60. C @ 3. min, 5. K/min, 320. C @ 20. min |
Capillary | XTI-5 | 532.52 | Engkvist, Borowski, et al., 1996 | 15. m/0.28 mm/0.25 μm, H2, 70. C @ 2. min, 5. K/min; Tend: 350. C |
Capillary | DB-5 | 536.99 | Wise, Benner, et al., 1988 | 30. m/0.25 mm/0.25 μm, 40. C @ 2. min, 4. K/min, 280. C @ 5. min |

Lee's RI, non-polar column, custom temperature program

Column type | Active phase | I | Reference | Comment |
---|---|---|---|---|
Capillary | HP-5MS | 536.92 | Wang, Li, et al., 2007 | 30. m/0.25 mm/0.25 μm, He; Program: 60C(2min) => 6C/min => 258C => 2C/min => 300C(4min) |
Capillary | HP-5MS | 536.71 | Wang, Li, et al., 2007, 2 | 30. m/0.25 mm/0.25 μm, He; Program: not specified |
Capillary | HP-5MS | 536.89 | Wang, Li, et al., 2007, 2 | 30. m/0.25 mm/0.25 μm, He; Program: not specified |
Capillary | HP-5MS | 536.92 | Wang, Li, et al., 2007, 2 | 30. m/0.25 mm/0.25 μm, He; Program: not specified |
Capillary | DB-5 | 558.6 | Lundstedt, Haglund, et al., 2003 | 30. m/0.25 mm/0.25 μm; Program: not specified |
Capillary | 5 % Phenyl methyl siloxane | 536.71 | Allen J.O., Durant J.L., et al., 1998 | Program: not specified |

References

Marynowski, Pieta, et al., 2004
Marynowski, L.; Pieta, M.; Janeczek, J.,
Composition and source of polycyclic aromatic compounds in deposited dust from selected sites around the Upper Silesia, Poland,
Geol. Q., 2004, 48, 2, 169-180. [all data]
Sauvain and Duc, 2004
Sauvain, J.-J.; Duc, T.V.,
Approaches to identifying and quantifying polycyclic aromatic hydrocarbons of molecular weight 302 in diesel particulates,
J. Sep. Sci., 2004, 27, 1-2, 78-88, https://doi.org/10.1002/jssc.200301620
. [all data]
Engkvist, Borowski, et al., 1996
Engkvist, O.; Borowski, P.; Bemgård, A.; Karlström, G.; Lindh, R.; Colmsjö, A.,
On the relation between retention indexes and the interaction between the solute and the column in gas-liquid chromatography,
J. Chem. Inf. Comput. Sci., 1996, 36, 6, 1153-1161, https://doi.org/10.1021/ci960345u
. [all data]
Wise, Benner, et al., 1988
Wise, S.A.; Benner, B.A.; Byrd, G.D.; Chesler, S.N.; Rebbert, R.E.; Schantz, M.M.,
Determination of polycyclic aromatic hydrocarbons in a coal tar standard reference material,
Anal. Chem., 1988, 60, 9, 887-894, https://doi.org/10.1021/ac00160a012
. [all data]
Wang, Li, et al., 2007
Wang, Z.; Li, K.; Lambert, P.; Yang, C.,
Identification, characterization and quantitation of pyrogenic polycylic aromatic hydrocarbons and other organic compounds in tire fire products,
J. Chromatogr. A, 2007, 1139, 1, 14-26, https://doi.org/10.1016/j.chroma.2006.10.085
. [all data]
Wang, Li, et al., 2007, 2
Wang, Z.; Li, K.; Lambert, P.; Brown, C.E.; Yang, C.; Hollebone, B.P.,
Identification and characterization of polycyclic aromatic compounds in tire fire products and differentiation of pyrogenic PAHs from petrogenic PAHs
in Proceedings of the 30th Arctic and Marine Oilspill (AMOP) Technical Seminar. Vol.1, 2007, 61-85. [all data]
Lundstedt, Haglund, et al., 2003
Lundstedt, S.; Haglund, P.; Öberg, L.,
Degradation and formation of polycyclic aromatic compounds during bioslurry treatment of an aged gasworks soil,
Environ. Toxicol. Chem., 2003, 22, 7, 1413-1420, https://doi.org/10.1002/etc.5620220701
. [all data]
Allen J.O., Durant J.L., et al., 1998
Allen J.O.; Durant J.L.; Dookeran N.M.; Taghizadeh K.; Plummer E.F.; Lafleur A.L.; Sarofim A.F.; Smith K.A.,
Measurement of C24H14 polycyclic aromatic hydrocarbons associated with a size-segregated urban aerosol,
Environ. Sci. Technol., 1998, 32, 13, 1928-1932, https://doi.org/10.1021/es970919r
. [all data]