Silane, methoxydimethyl(pentafluorophenyl)-
- Formula: C9H9F5OSi
- Molecular weight: 256.2447
- IUPAC Standard InChIKey: CEEVCOGSFYACND-UHFFFAOYSA-N
- CAS Registry Number: 23761-74-2
- Chemical structure:
View 3d structure (requires JavaScript / HTML 5) - Other names: Methoxy(dimethyl)(2,3,4,5,6-pentafluorophenyl)silane; Benzene, 1,2,3,4,5-pentafluoro-6-(methoxydimethylsilyl)-; Methanol, FP; Methanol DNPFPS

Kovats' RI, non-polar column, custom temperature program

Column type | Active phase | I | Reference | Comment |
---|---|---|---|---|
Packed | SE-30 | 1000. | Francis, Morgan, et al., 1978 | N2, Chromosorb P AW DMCS; Column length: 2. m; Program: not specified |

References

Francis, Morgan, et al., 1978
Francis, A.J.; Morgan, E.D.; Poole, C.F.,
Flophemesyl Derivatives of Alcohols, Phenols, Amines and Carboxylic Acids and Their Use in Gas Chromatography with Electron-Capture Detection,
J. Chromatogr., 1978, 161, 111-117, https://doi.org/10.1016/S0021-9673(01)85218-3
. [all data]