Pentaborane(9), 1-ethyl-

Phase change data

Data compiled by: William E. Acree, Jr., James S. Chickos

Enthalpy of vaporization

ΔvapH (kJ/mol) Temperature (K) Reference Comment
35.0328.Ryschkewitsch, Harris, et al., 1963Based on data from 273. - 383. K.

References

Ryschkewitsch, Harris, et al., 1963
Ryschkewitsch, G.E.; Harris, S.W.; Mezey, E.J.; Sisler, Harry H.; Weilmuenster, E.A.; Garrett, A.B., Alkylation of Pentaborane-9 Catalyzed by Lewis Acids, Inorg. Chem., 1963, 2, 5, 890-893, https://doi.org/10.1021/ic50009a002 . [all data]