3,4-Methylenedioxycinnamic acid

Condensed phase thermochemistry data

Data compiled by: Hussein Y. Afeefy, Joel F. Liebman, and Stephen E. Stein

Quantity Value Units Method Reference Comment
Δfsolid-144.8kcal/molCcbZavoianu, Ciocazan, et al., 1990
Quantity Value Units Method Reference Comment
Δcsolid-1068.9kcal/molCcbZavoianu, Ciocazan, et al., 1990Corresponding Δfsolid = -144.9 kcal/mol (simple calculation by NIST; no Washburn corrections)
Δcsolid-1068.8kcal/molCcbRoth and Stoermer, 1913Corresponding Δfsolid = -145.0 kcal/mol (simple calculation by NIST; no Washburn corrections)

References

Zavoianu, Ciocazan, et al., 1990
Zavoianu, D.; Ciocazan, I.; Moga-Gheorghe, S.; Bornaz, C., Structure and reactivity of acids. Heats of combustion and formation of some phenylacrylic acids., Rev. Chim. (Bucharest), 1990, 41, 234-236. [all data]

Roth and Stoermer, 1913
Roth, W.A.; Stoermer, R., Physikalisch-chemische untersuchungen an aromatischen stereoisomeren sauren 1, Chem. Ber., 1913, 40, 260-280. [all data]