1-Pentanol, 2,2-dimethyl-
- Formula: C7H16O
- Molecular weight: 116.2013
- IUPAC Standard InChIKey: QTOMCRXZFDHJOL-UHFFFAOYSA-N
- CAS Registry Number: 2370-12-9
- Chemical structure:
View 3d structure (requires JavaScript / HTML 5) - Other names: Neoheptanol; 2,2-Dimethyl-1-pentanol; 2,2-Dimethylpentanol; 2,2-dimethylpentan-1-ol

Phase change data

Data compiled by: Thermodynamics Research Center, NIST Boulder Laboratories, Chris Muzny director
Quantity | Value | Units | Method | Reference | Comment |
---|---|---|---|---|---|
Tboil | 427.15 | K | N/A | McElrath, Fritz, et al., 1960 | Uncertainty assigned by TRC = 2. K |
Tboil | 425.9 | K | N/A | Brannock, 1959 | Uncertainty assigned by TRC = 2. K |

Normal alkane RI, non-polar column, custom temperature program

Data compiled by: NIST Mass Spectrometry Data Center, William E. Wallace, director

Column type CapillaryCapillary
Active phase SE-30Polydimethyl siloxane
Column length (m)
Carrier gas
Substrate
Column diameter (mm)
Phase thickness (μm)
Program not specifiednot specified
I 874.868.
ReferenceVinogradov, 2004Junkes, Castanho, et al., 2003
Comment MSDC-RI MSDC-RI

References

McElrath, Fritz, et al., 1960
McElrath, E.N.; Fritz, R.M.; Brown, C.; Legall, C.Y.; Duke, R.B.,
Kinetics of the acetolysis of some alkyl-substituted neopentyl p- bromobenzenesulfonates,
J. Org. Chem., 1960, 25, 2195-200. [all data]
Brannock, 1959
Brannock, K.C.,
Preparation of substituted 4-pentenals,
J. Am. Chem. Soc., 1959, 81, 3379. [all data]