Naphthalene, 1,3,8-trinitro-
- Formula: C10H5N3O6
- Molecular weight: 263.1632
- IUPAC Standard InChIKey: BEKZHETVNVFYCV-UHFFFAOYSA-N
- CAS Registry Number: 2364-46-7
- Chemical structure:
View 3d structure (requires JavaScript / HTML 5) - Permanent link for this species. Use this link for bookmarking this species for future reference.

Condensed phase thermochemistry data

Data compiled by: Hussein Y. Afeefy, Joel F. Liebman, and Stephen E. Stein
Quantity | Value | Units | Method | Reference | Comment |
---|---|---|---|---|---|
ΔfH°solid | -8.49 | kJ/mol | Ccb | Rinkenbach, 1930 | Author hf298_condensed[kcal/mol]=5.725 |
Quantity | Value | Units | Method | Reference | Comment |
ΔcH°solid | -4673.9 ± 4.6 | kJ/mol | Ccb | Badoche, 1937 | Reanalyzed by Cox and Pilcher, 1970, Original value = -4676.34 kJ/mol |
ΔcH°solid | -4641.23 | kJ/mol | Ccb | Rinkenbach, 1930 | Author hf298_condensed[kcal/mol]=5.725 |

References

Rinkenbach, 1930
Rinkenbach, W.H.,
The heats of combustion and formation of aromatic nitro compounds,
J. Am. Chem. Soc., 1930, 52, 115-120. [all data]
Badoche, 1937
Badoche, M.,
Determinations de la chaleur de combustion de quelques derives nitres du naphtalene,
Bull. Soc. Chim. France, 1937, 4, 549-557. [all data]
Cox and Pilcher, 1970
Cox, J.D.; Pilcher, G.,
Thermochemistry of Organic and Organometallic Compounds, Academic Press, New York, 1970, 1-636. [all data]