2-Octenal

Kovats' RI, non-polar column, custom temperature program

View large format table.

Column type Active phase I Reference Comment
PackedApiezon L1055.Minyard, Tumlinson, et al., 1967N2, Gas Chrom P; Column length: 3.0 m; Program: not specified

Kovats' RI, polar column, temperature ramp

View large format table.

Column type Active phase I Reference Comment
CapillaryPE-Wax1445.Venkateshwarlu, Chandravadana, et al., 1999N2, 60. C @ 4. min, 5. K/min, 200. C @ 5. min; Column length: 30. m; Column diameter: 0.25 mm

Van Den Dool and Kratz RI, non-polar column, temperature ramp

View large format table.

Column type Active phase I Reference Comment
CapillaryHP-5MS1056.Kallio, Jussila, et al., 200620. m/0.25 mm/0.25 μm, 60. C @ 4. min, 5. K/min, 240. C @ 15. min
CapillaryHP-51055.Javidnia, Miri, et al., 2004He, 3. K/min; Column length: 30. m; Column diameter: 0.25 mm; Tstart: 60. C; Tend: 260. C
CapillaryHP-5MS1061.Weissbecker, Holighaus, et al., 200430. m/0.25 mm/0.25 μm, He, 50. C @ 1.5 min, 6. K/min, 200. C @ 5. min
CapillarySPB-Sulfur1036.6de Lacy Costello, Evans, et al., 200130. m/0.32 mm/4. μm, 40. C @ 12.5 min, 4. K/min; Tend: 200. C
PackedApiezon M1028.Golovnya and Uraletz, 1971N2, Celite 545, 6. K/min; Column length: 1.5 m; Tstart: 75. C; Tend: 200. C
PackedApiezon M1033.Golovnya and Uraletz, 1971N2, Celite 545, 6. K/min; Column length: 1.5 m; Tstart: 75. C; Tend: 200. C
PackedApiezon M1039.Golovnya and Uraletz, 1971N2, Celite 545, 6. K/min; Column length: 1.5 m; Tstart: 75. C; Tend: 200. C

Van Den Dool and Kratz RI, non-polar column, custom temperature program

View large format table.

Column type Active phase I Reference Comment
CapillaryDB-5MS1059.Turchini, Giani, et al., 200430. m/0.25 mm/0.25 μm, He; Program: 35C => 120C/min => 60C1.5C/min => 100C => 5C/min => 280C
CapillaryDB-51060.Klesk and Qian, 200330. m/0.32 mm/1. μm, He; Program: 40C(2min) => 2C/min => 100C => 10C/min => 230C (5min)
CapillaryHP-51060.Engel, Baty, et al., 200230. m/0.25 mm/0.25 μm, He; Program: 5C(5min) => 3C/min => 20C => 5C/min => 100C 15C/min => 150C (5min)
CapillaryDB-51071.Parker, Hassell, et al., 200050. m/0.32 mm/0.5 μm, He; Program: oC(5min) => 60C/min => 60C (5min) => 4C/min => 250C
CapillarySE-541056.Derail, Hofmann, et al., 199930. m/0.32 mm/0.25 μm, He; Program: 35C (2min) => 40C/min => 50C => 4C/min => 230C (10min)

Van Den Dool and Kratz RI, polar column, temperature ramp

View large format table.

Column type Active phase I Reference Comment
CapillaryDB-Wax1427.Pozo-Bayon M.A., Ruiz-Rodriguez A., et al., 200730. m/0.25 mm/0.5 μm, He, 40. C @ 5. min, 4. K/min, 250. C @ 15. min
CapillaryZB-Wax1382.Ledauphin, Basset, et al., 200630. m/0.25 mm/0.15 μm, He, 35. C @ 5. min, 5. K/min, 220. C @ 10. min
CapillaryZB-Wax1402.Ledauphin, Saint-Clair, et al., 200430. m/0.25 mm/0.15 μm, He, 35. C @ 5. min, 5. K/min, 220. C @ 10. min
CapillaryCP-Wax 52CB1413.Chevance, Farmer, et al., 200060. C @ 5. min, 4. K/min, 220. C @ 30. min; Column length: 50. m; Column diameter: 0.32 mm
CapillaryCP-Wax 52CB1421.Chevance and Farmer, 199960. C @ 5. min, 4. K/min, 220. C @ 30. min; Column length: 50. m; Column diameter: 0.32 mm

Van Den Dool and Kratz RI, polar column, custom temperature program

View large format table.

Column type Active phase I Reference Comment
CapillaryFFAP1460.Ranau, Kleeberg, et al., 200560. m/0.25 mm/0.5 μm, He; Program: 50C(3min) => 3C/min => 100C => 10C/min => 220C(13.5min)
CapillaryDB-Wax1436.Ziegleder, 2001He; Column length: 60. m; Column diameter: 0.25 mm; Program: 45C(4min) => 30C/min => 60C (5min) => 3C/min => 220C (40min)
CapillaryFFAP1400.Derail, Hofmann, et al., 199930. m/0.32 mm/0.25 μm, He; Program: 35C (2min) => 40C/min => 60C => 4C/min => 230C (10min)

Normal alkane RI, non-polar column, isothermal

View large format table.

Column type Active phase Temperature (C) I Reference Comment
CapillaryOV-101120.1042.Kenndler, Jenner, et al., 1985He; Column length: 30. m; Column diameter: 0.25 mm

Normal alkane RI, non-polar column, temperature ramp

View large format table.

Column type Active phase I Reference Comment
CapillarySPB-51057.Sebastian, Viallon-Fernandez, et al., 200360. m/0.32 mm/1.0 μm, Helium, 3. K/min; Tstart: 30. C; Tend: 230. C
CapillaryDB-51056.Meynier, Novelli, et al., 199930. m/0.32 mm/1. μm, 40. C @ 5. min, 3. K/min; Tend: 200. C
CapillaryHP-51059.Boylston and Viniyard, 199850. m/0.32 mm/0.52 μm, 35. C @ 15. min, 2. K/min, 250. C @ 45. min
CapillaryUltra-21063.King, Matthews, et al., 199550. m/0.32 mm/0.52 μm, He, 40. C @ 3. min, 4. K/min, 250. C @ 30. min
CapillaryUltra-21075.King, Hamilton, et al., 199350. m/0.32 mm/0.52 μm, He, 40. C @ 3. min, 4. K/min, 250. C @ 30. min
CapillaryHG-51062.Drumm and Spanier, 199150. m/0.32 mm/0.52 μm, He, 35. C @ 15. min, 3. K/min, 250. C @ 45. min
CapillaryHP-51045.Spadone, Takeoka, et al., 1990H2, 16. K/min; Column length: 50. m; Column diameter: 0.3 mm; Tstart: 80. C; Tend: 250. C
CapillaryHP-51059.Spadone, Takeoka, et al., 1990H2, 16. K/min; Column length: 50. m; Column diameter: 0.3 mm; Tstart: 80. C; Tend: 250. C
CapillarySE-541048.Bestmann, Classen, et al., 1988N2, 60. C @ 2. min, 6. K/min; Column length: 25. m; Column diameter: 0.25 mm; Tend: 260. C
CapillaryDB-11031.Habu, Flath, et al., 19853. K/min; Column length: 50. m; Column diameter: 0.32 mm; Tstart: 0. C; Tend: 250. C
CapillaryDB-11027.Habu, Flath, et al., 19853. K/min; Column length: 50. m; Column diameter: 0.32 mm; Tstart: 50. C; Tend: 250. C

Normal alkane RI, non-polar column, custom temperature program

View large format table.

Column type Active phase I Reference Comment
CapillarySLB-5 MS1059.Mondello, 201230. m/0.25 mm/0.25 μm, Helium; Program: not specified
CapillarySLB-5 MS1062.Mondello, 201230. m/0.25 mm/0.25 μm, Helium; Program: not specified
CapillaryVF-51059.Shivashankar, Roy, et al., 201230. m/0.25 mm/0.25 μm, Helium; Program: 50 0C (2 min) 3 0C/min -> 200 0C (3 min) 10 0C/min -> 220 0C (8 min)
CapillaryVF-51060.Shivashankar, Roy, et al., 201230. m/0.25 mm/0.25 μm, Helium; Program: not specified
CapillaryHP-51062.Rotsatschakul, Visesanguan, et al., 200960. m/0.25 mm/0.25 μm, Helium; Program: 30 0C (2 min) 2 0Cmin -> 60 0C 10 0C/min -> 100 0C 20 0C/min -> 140 0C 10 0C/min -> 200 0C (10 min)
CapillaryDB-5 MS1062.Cajka, Hajslova, et al., 200730. m/0.25 mm/0.25 μm, Helium; Program: 45 0C (0.75 min) 10 0C/min -> 200 0C 30 0C/min -> 245 0C (1.25 min)
CapillaryDB-11034.Lin, Peng, et al., 200760. m/0.25 mm/0.25 μm, N2; Program: 40C(1min) => 5C/min => 150C => 10C/min => 200C(9min)
CapillaryDB-11023.Cramer, Mattinson, et al., 200560. m/0.32 mm/0.25 μm, He; Program: 33C(5min) => 2C/min => 50c => 5C/min => 225C
CapillaryHP-5 MS1059.Turchini, Giani, et al., 200530. m/0.25 mm/0.25 μm, Helium; Program: 35 0C (1 min) 120 0C/min -> 60 0C 1.5 0C/min -> 100 0C 5 0C/min -> 280 0C
CapillaryBPX-51055.Machiels, Istasse, et al., 200460. m/0.32 mm/1. μm, He; Program: 40C (4min) => 2C/min => 90C => 4C/min => 130C => 8C/min => 250 C (10min)
CapillaryMDN-51041.Moretti, Madonia, et al., 200430. m/0.25 mm/0.25 μm, Helium; Program: 30 0C (1 min) ballistically -> 60 0C 2 0C/min -> 120 0C 5 0C/min -> 280 0C (5 min)
CapillaryMDN-51046.Turchimi, Mentasti, et al., 200430. m/0.25 mm/0.25 μm, Helium; Program: 35 0C (1 min) 120 0C/min -> 60 0C 2 0C/min -> 280 0C
CapillaryRTX-5 MS1064.Machiels and Istasse, 200360. m/0.25 mm/0.5 μm, He; Program: 35C (3min) => 10C/min => 50C => 4C/min => 200C => 50C/min => 250C (10min)
CapillaryDB-5MS1060.Young, Lane, et al., 200330. m/0.25 mm/1. μm; Program: 50C => 3C/min => 160C => 6C/min => 250C => 25C/min => 325C
CapillaryHP-5MS1060.Ansorena, Gimeno, et al., 200130. m/0.25 mm/0.25 μm, He; Program: 40C (10min) => 3C/min => 120C => 10C/min => 250C (5min)
CapillaryPolydimethyl siloxane1045.Spanier, Shahidi, et al., 2001Program: not specified
CapillaryMethyl Silicone1036.Misharina, 1995Program: not specified

Normal alkane RI, polar column, isothermal

View large format table.

Column type Active phase Temperature (C) I Reference Comment
CapillaryPEG-20M90.1378.Kenndler, Jenner, et al., 1985He; Column length: 12.5 m; Column diameter: 0.20 mm

Normal alkane RI, polar column, temperature ramp

View large format table.

Column type Active phase I Reference Comment
CapillaryFFAP1414.Piyachaiseth, Jirapakkul, et al., 201160. m/0.25 mm/0.25 μm, Helium, 45. C @ 1. min, 5. K/min, 220. C @ 5. min
CapillaryCarbowax 20M1412.Xue, Ye, et al., 2000He, 60. C @ 2. min, 5. K/min, 190. C @ 20. min; Column length: 25. m; Column diameter: 0.3 mm
CapillaryDB-Wax1442.Iwatsuki, Mizota, et al., 19994. K/min; Column length: 30. m; Column diameter: 0.53 mm; Tstart: 60. C; Tend: 210. C
CapillaryDB-Wax1440.Iwatsuki, Mizota, et al., 19994. K/min; Column length: 30. m; Column diameter: 0.53 mm; Tstart: 60. C; Tend: 210. C

Normal alkane RI, polar column, custom temperature program

View large format table.

Column type Active phase I Reference Comment
CapillarySupelcowax-101416.de Simon, Estruelas, et al., 200930. m/0.25 mm/0.25 μm, Helium; Program: 45 0C 3 0C/min -> 230 0C (10 min) 10 0C/min -> 270 0C (21 min)
CapillaryDB-Wax1436.Ziegleder, 1998He; Column length: 60. m; Column diameter: 0.25 mm; Program: 45C(4min) => 30C/min => 60C (5min) => 3C/min => 220C(40min)

References

Minyard, Tumlinson, et al., 1967
Minyard, J.P.; Tumlinson, J.H.; Thompson, A.C.; Hedin, P.A., Constituents of the cotton bud. The carbonyl compounds, J. Agric. Food Chem., 1967, 15, 3, 517-524, https://doi.org/10.1021/jf60151a021 . [all data]

Venkateshwarlu, Chandravadana, et al., 1999
Venkateshwarlu, G.; Chandravadana, M.V.; Tewari, R.P., Volatile flavour components of some edible mushrooms (Basidiomycetes), Flavour Fragr. J., 1999, 14, 3, 191-194, https://doi.org/10.1002/(SICI)1099-1026(199905/06)14:3<191::AID-FFJ810>3.0.CO;2-7 . [all data]

Kallio, Jussila, et al., 2006
Kallio, M.; Jussila, M.; Rissanen, T.; Anttila, P.; Hartonen, K.; Reissell, A.; Vreuls, R.; Adahchour, M.; Hyotylainen, T., Comprehensive two-dimensional gas chromatography coupled to time-of-flight mass spectrometry in the identification of organic compounds in atmospheric aerosols from coniferous forest, J. Chromatogr. A, 2006, 1125, 2, 234-243, https://doi.org/10.1016/j.chroma.2006.05.050 . [all data]

Javidnia, Miri, et al., 2004
Javidnia, K.; Miri, R.; Kamalinejad, M.; Sarkarzadeh, H.; Jamalian, A., Chemical composition of the essential oils of Anthemis altissima L. grown in Iran, Flavour Fragr. J., 2004, 19, 3, 213-216, https://doi.org/10.1002/ffj.1277 . [all data]

Weissbecker, Holighaus, et al., 2004
Weissbecker, B.; Holighaus, G.; Schütz, S., Gas chromatography with mass spectrometric and electroantennographic detection: analysis of wood odorants by direct coupling of insect olfaction and mass spectrometry, J. Chromatogr. A, 2004, 1056, 1-2, 209-216, https://doi.org/10.1016/j.chroma.2004.06.120 . [all data]

de Lacy Costello, Evans, et al., 2001
de Lacy Costello, B.P.J.; Evans, P.; Ewen, R.J.; Gunson, H.E.; Jones, P.R.H.; Ratcliffe, N.M.; Spencer-Phillips, P.T.N., Gas chromatography-mass spectrometry analyses of volatile organic compounds from potato tubers inoculated with Phytophthora infestans or Fusarium coeruleum, Plant Pathol., 2001, 50, 4, 489-496, https://doi.org/10.1046/j.1365-3059.2001.00594.x . [all data]

Golovnya and Uraletz, 1971
Golovnya, V.; Uraletz, V.P., Gas chromatographic analysis of flavour components with correlation isothermal retention indices, J. Chromatogr., 1971, 61, 65-71, https://doi.org/10.1016/S0021-9673(00)92384-7 . [all data]

Turchini, Giani, et al., 2004
Turchini, G.M.; Giani, I.; Caprino, F.; Moretti, V.M.; Valfrè, F., Discrimination of origin of farmed trout by means of biometrical parameters, fillet composition and flavor volatile compounds, Ital. J. Anim. Sci., 2004, 3, 123-140. [all data]

Klesk and Qian, 2003
Klesk, K.; Qian, M., Preliminary aroma comparison of Marion (Rubus spp. hyb) and Evergreen (R. laciniatus L.) blackberries by dynamic headspace/OSME technique, J. Food Sci., 2003, 68, 2, 697-700, https://doi.org/10.1111/j.1365-2621.2003.tb05734.x . [all data]

Engel, Baty, et al., 2002
Engel, E.; Baty, C.; le Corre, D.; Souchon, I.; Martin, N., Flavor-active compounds potentially implicated in cooked cauliflower acceptance, J. Agric. Food Chem., 2002, 50, 22, 6459-6467, https://doi.org/10.1021/jf025579u . [all data]

Parker, Hassell, et al., 2000
Parker, J.K.; Hassell, G.M.E.; Mottram, D.S.; Guy, R.C.E., Sensory and instrumental analyses of volatiles generated during the extrusion cooking of oat flours, J. Agric. Food Chem., 2000, 48, 8, 3497-3506, https://doi.org/10.1021/jf991302r . [all data]

Derail, Hofmann, et al., 1999
Derail, C.; Hofmann, T.; Schieberle, P., Differences in key odorants of handmade juice of yellow-flesh peaches (Prunus persica L.) induced by the workup procedure, J. Agric. Food Chem., 1999, 47, 11, 4742-4745, https://doi.org/10.1021/jf990459g . [all data]

Pozo-Bayon M.A., Ruiz-Rodriguez A., et al., 2007
Pozo-Bayon M.A.; Ruiz-Rodriguez A.; Pernin K.; Cayot N., Influence of eggs on the aroma composition of a sponge cake and on the aroma release in model studies on flavored sponge cakes, J. Agric. Food Chem., 2007, 55, 4, 1418-1426, https://doi.org/10.1021/jf062203y . [all data]

Ledauphin, Basset, et al., 2006
Ledauphin, J.; Basset, B.; Cohen, S.; Payot, T.; Barillier, D., Identification of trace volatile compounds in freshly distilled Calvados and Cognac: Carbonyl and sulphur compounds, J. Food Comp. Anal., 2006, 19, 1, 28-40, https://doi.org/10.1016/j.jfca.2005.03.001 . [all data]

Ledauphin, Saint-Clair, et al., 2004
Ledauphin, J.; Saint-Clair, J.-F.; Lablanquie, O.; Guichard, H.; Founier, N.; Guichard, E.; Barillier, D., Identification of trace volatile compounds in freshly distilled calvados and cognac using preparative separations coupled with gas chromatography-mass spectrometry, J. Agric. Food Chem., 2004, 52, 16, 5124-5134, https://doi.org/10.1021/jf040052y . [all data]

Chevance, Farmer, et al., 2000
Chevance, F.F.V.; Farmer, L.J.; Desmond, E.M.; Novelli, E.; Troy, D.J.; Chizzolini, R., Effect of some fat replacers on the release of volatile aroma compounds from low-fat meat products, J. Agric. Food Chem., 2000, 48, 8, 3476-3484, https://doi.org/10.1021/jf991211u . [all data]

Chevance and Farmer, 1999
Chevance, F.F.V.; Farmer, L.J., Identification of major volatile odor compounds in frankfurters, J. Agric. Food Chem., 1999, 47, 12, 5151-5160, https://doi.org/10.1021/jf990515d . [all data]

Ranau, Kleeberg, et al., 2005
Ranau, R.; Kleeberg, K.K.; Schlegelmilch, M.; Streese, J.; Stegmann, R.; Steinhart, H., Analytical determination of the suitability of different processes for the treatment of odorous waste gas, Waste Management, 2005, 25, 9, 908-916, https://doi.org/10.1016/j.wasman.2005.07.004 . [all data]

Ziegleder, 2001
Ziegleder, G., Odorous compounds in paperboard as influenced by recycled material and storage, Packag. Technol. Sci., 2001, 14, 4, 131-136, https://doi.org/10.1002/pts.541 . [all data]

Kenndler, Jenner, et al., 1985
Kenndler, E.; Jenner, P.; Huber, J.F.K., Identification and Quantitative Estimation of Organic Pollutants in the Exhaust Air of Electric Ranges by Two-dimensional GC and GC/MS, Fresenius J. Anal. Chem., 1985, 322, 2, 198-204, https://doi.org/10.1007/BF00517659 . [all data]

Sebastian, Viallon-Fernandez, et al., 2003
Sebastian, I.; Viallon-Fernandez, C.; Berge, P.; Berdague, J.-L., Analysis of the volatile fraction of lamb fat tissue: influence of the type of feeding, Sciences des Aliments, 2003, 23, 4, 497-511, https://doi.org/10.3166/sda.23.497-511 . [all data]

Meynier, Novelli, et al., 1999
Meynier, A.; Novelli, E.; Chissolinim, R.; Zanardi, E.; Gandemer, G., Volatile compounds of commercial Milano salami, Meat Sci., 1999, 51, 2, 175-183, https://doi.org/10.1016/S0309-1740(98)00122-3 . [all data]

Boylston and Viniyard, 1998
Boylston, T.D.; Viniyard, B.T., Isolation of volatile flavor compounds from peanut butter using purge-and-trap technique in Instrumental Methods in Food and Beverage Analysis, D. Wetzel and G. Charalambous, ed(s)., 1998, 225-243. [all data]

King, Matthews, et al., 1995
King, M.-F.; Matthews, M.A.; Rule, D.C.; Field, R.A., Effect of beef packaging method on volatile compounds developed by oven roasting or microwave cooking, J. Agric. Food Chem., 1995, 43, 3, 773-778, https://doi.org/10.1021/jf00051a039 . [all data]

King, Hamilton, et al., 1993
King, M.-F.; Hamilton, B.L.; Matthews, M.A.; Rule, D.C.; Field, R.A., Isolation and identification of volatiles and condensable material in raw beef with supercritical carbon dioxide extraction, J. Agric. Food Chem., 1993, 41, 11, 1974-1981, https://doi.org/10.1021/jf00035a030 . [all data]

Drumm and Spanier, 1991
Drumm, T.D.; Spanier, A.M., Changes in the content of lipid autoxidation and sulfur-containing compounds in cooked beef during storage, J. Agric. Food Chem., 1991, 39, 2, 336-343, https://doi.org/10.1021/jf00002a023 . [all data]

Spadone, Takeoka, et al., 1990
Spadone, J.-C.; Takeoka, G.; Liardon, R., Analytical Investigation of Rio Off-Flavor in Green Coffee, J. Agric. Food Chem., 1990, 38, 1, 226-233, https://doi.org/10.1021/jf00091a050 . [all data]

Bestmann, Classen, et al., 1988
Bestmann, H.-J.; Classen, B.; Kobold, U.; Vostrowsky, O.; Klingauf, F.; Stein, U., Steam volatile constituents from leaves of Rhus typhina, Phytochemistry, 1988, 27, 1, 85-90, https://doi.org/10.1016/0031-9422(88)80595-8 . [all data]

Habu, Flath, et al., 1985
Habu, T.; Flath, R.A.; Mon, T.R.; Morton, J.F., Volatile components of Rooibos tea (Aspalathus linearis), J. Agric. Food Chem., 1985, 33, 2, 249-254, https://doi.org/10.1021/jf00062a024 . [all data]

Mondello, 2012
Mondello, L., HS-SPME-GCxGC-MS analysis of Yerba Mate (Ilex paraguariensis) in Shimadzu GC-GC application compendium of comprehensive 2D GC, Vol. 1-5, Shimadzu Corp., 2012, 1-29. [all data]

Shivashankar, Roy, et al., 2012
Shivashankar, S.; Roy, T.K.; Moorthy, P.N.R., Headspace solid phase micro extraction and GC/MS analysis of the volatile components in seed and cake of Azadirachta indica A. juss, Chem. Bull. of Politechnika Univ. Timisoara, Romania, 2012, 57(71), 1, 1-6. [all data]

Rotsatschakul, Visesanguan, et al., 2009
Rotsatschakul, P.; Visesanguan, W.; Smitinont, T.; Chaiseri, S., Changes in volatile compounds during fermentation of nham (Thai fermented sausage), Int. Food Res. J., 2009, 16, 391-414. [all data]

Cajka, Hajslova, et al., 2007
Cajka, T.; Hajslova, J.; Cochran, J.; Holadova, K.; Klimankova, E., Solid phase microextraction - comprehensive two dimensional gas chromatography - time-of-flight mass spectrometry for the analysis of honey volatiles, J. Sep. Sci., 2007, 30, 4, 534-546, https://doi.org/10.1002/jssc.200600413 . [all data]

Lin, Peng, et al., 2007
Lin, L.-Y.; Peng, C.-H.; Wang, H.-E.; Wu, T.-H.; Chen, C.-C.; Yu, T.-H.; Wu, C.-M.; Peng, R.Y., Factors affecting solid phase microextraction (SPME) to concentrate the odorants of Chinese white salted noodles for GC-MS analysis, Flavour Fragr. J., 2007, 22, 4, 274-279, https://doi.org/10.1002/ffj.1792 . [all data]

Cramer, Mattinson, et al., 2005
Cramer, A.-C.J.; Mattinson, D.S.; Fellman, J.K.; Baik, B.-K., Analysis of volatile compounds from various types of barley cultivars, J. Agric. Food Chem., 2005, 53, 19, 7526-7531, https://doi.org/10.1021/jf0506939 . [all data]

Turchini, Giani, et al., 2005
Turchini, G.M.; Giani, I.; Caprino, F.; Moretti, V.M.M.; Valfre, F., Discrimination of origin og farmed trout by means of biometrical parameters, fillet composition and flavor volatile compounds, Ital. J. Animal Sci., 2005, 3, 123-140. [all data]

Machiels, Istasse, et al., 2004
Machiels, D.; Istasse, L.; van Ruth, S.M., Gas chromatography-olfactometry analysis of beef meat originating from differently fed Belgian Blue, Limousin and Aberdeen Angus bulls, Food Chem., 2004, 86, 3, 377-383, https://doi.org/10.1016/j.foodchem.2003.09.011 . [all data]

Moretti, Madonia, et al., 2004
Moretti, V.M.; Madonia, G.; Diaferia, C.; Mentasti, T.; Paleari, M.A.; Panseri, S.; Pirone, G.; Gandini, G., Chemical and microniological parameters and sensory attributes of a typical Sicilian salami ripened in different conditions, Meat Sci., 2004, 66, 4, 845-854, https://doi.org/10.1016/j.meatsci.2003.08.006 . [all data]

Turchimi, Mentasti, et al., 2004
Turchimi, G.N.; Mentasti, T.; Carpino, F.; Panseri, S.; Moretti, V.M.; Valfre, F., Effects of dietary lipid sources on flavour volatile compounds of brown trout (Salmo trurra L.) fillet, J. Appl. Ichtyol., 2004, 20, 1, 71-75, https://doi.org/10.1046/j.0175-8659.2003.00522.x . [all data]

Machiels and Istasse, 2003
Machiels, D.; Istasse, L., Evaluation of two commercial solid-phase microextraction fibres for the analysis of target aroma compounds in cooked beef meat, Talanta, 2003, 61, 4, 529-537, https://doi.org/10.1016/S0039-9140(03)00319-9 . [all data]

Young, Lane, et al., 2003
Young, O.A.; Lane, G.A.; Priolo, A.; Fraser, K., Pastoral and species flavour in lambs raised on pasture, lucerne or maize, J. Sci. Food Agric., 2003, 83, 2, 93-104, https://doi.org/10.1002/jsfa.1282 . [all data]

Ansorena, Gimeno, et al., 2001
Ansorena, D.; Gimeno, O.; Astiasarán, I.; Bello, J., Analysis of volatile compounds by GC-MS of a dry fermented sausage: chorizo de Pamplona, Food Res. Int., 2001, 34, 1, 67-75, https://doi.org/10.1016/S0963-9969(00)00133-2 . [all data]

Spanier, Shahidi, et al., 2001
Spanier, A.M.; Shahidi, F.; Par; iment, T.H.; Mussinan, C., Food Flavors and Chemistry. Advances of the New Millenium, Royal Soc. Chem., 2001, 666. [all data]

Misharina, 1995
Misharina, T.A., Sorption regularities of sulfur- and oxygen-containing compounds in chromatography and their application in identification of volatile organic compounds, Diss. degree of Dr. Sci. (Chemistry), 1995, 52. [all data]

Piyachaiseth, Jirapakkul, et al., 2011
Piyachaiseth, T.; Jirapakkul, W.; Chaiseri, S., Aroma compounds of flash-fried rice, Kasetsart J. (Nat. Sci.), 2011, 45, 717-729. [all data]

Xue, Ye, et al., 2000
Xue, C.; Ye, M.; Li, Z.; Cai, Y.; Tan, L.; Lin, H.; Sakaguchi, M., Changes in the volatile compounds of Yellowtail (Seriola aureovitata) during refrigerated storage, Asian Fisheries Sciences, 2000, 13, 263-270. [all data]

Iwatsuki, Mizota, et al., 1999
Iwatsuki, K.; Mizota, Y.; Kubota, T.; Nishimura, O.; Masuda, H.; Sotoyama, K.; Tomita, M., Aroma extract dilution analysis. Evluation of aroma of pasteurized and UHT processed milk by aroma extract dilution analysis, Nippon Shokuhin Kagaku Kogaku Kaishi, 1999, 46, 9, 587-597, https://doi.org/10.3136/nskkk.46.587 . [all data]

de Simon, Estruelas, et al., 2009
de Simon, B.F.; Estruelas, E.; Munoz, A.M.; Cadahia, E.; Sanz, M., Volatile compounds in acacia, chestnut, cherry, ash, and oak woods, with a view to their use in cooperage, J. Agric. Food Chem., 2009, 57, 8, 3217-3227, https://doi.org/10.1021/jf803463h . [all data]

Ziegleder, 1998
Ziegleder, G., Volatile and odorous compounds in unprinted paperboard, Packag. Technol. Sci., 1998, 11, 5, 231-239, https://doi.org/10.1002/(SICI)1099-1522(1998090)11:5<231::AID-PTS437>3.0.CO;2-A . [all data]