Disiloxane, 1,3-bis(chloromethyl)-1,1,3,3-tetramethyl-
- Formula: C6H16Cl2OSi2
- Molecular weight: 231.268
- IUPAC Standard InChIKey: NBGGEWGFZUDQKZ-UHFFFAOYSA-N
- CAS Registry Number: 2362-10-9
- Chemical structure:
View 3d structure (requires JavaScript / HTML 5) - Other names: Bis(chloromethyl)tetramethyldisiloxane; 1,3-Bis(chloromethyl)tetramethyldisiloxane; 1,3-Bis(chloromethyl)-1,1,3,3-tetramethyldisiloxane; Tetramethyl-1,3-bis(chloromethyl)disiloxane; Tetramethylbis(chloromethyl)disiloxane

Phase change data

Data compiled by: Robert L. Brown and Stephen E. Stein
Reduced pressure boiling point
Tboil (K) | Pressure (bar) | Reference |
---|---|---|
365. | 0.016 | PCR Inc., 1990 |

Van Den Dool and Kratz RI, non-polar column, custom temperature program

Column type | Active phase | I | Reference | Comment |
---|---|---|---|---|
Capillary | VF-5MS | 1144. | Tretyakov, 2011 | 30. m/0.25 mm/0.25 μm, He; Program: Multi-step temperature program; T(initial)=60C; T(final)=270C |

References

PCR Inc., 1990
PCR Inc.,
Research Chemicals Catalog 1990-1991, PCR Inc., Gainesville, FL, 1990, 1. [all data]
Tretyakov, 2011
Tretyakov, K.V.,
Retention Data. NIST Mass Spectrometry Data Center., NIST Mass Spectrometry Data Center, 2011. [all data]