2-Thiophenecarboxylic acid hydrazide
- Formula: C5H6N2OS
- Molecular weight: 142.179
- IUPAC Standard InChIKey: SOGBOGBTIKMGFS-UHFFFAOYSA-N
- CAS Registry Number: 2361-27-5
- Chemical structure:
View 3d structure (requires JavaScript / HTML 5) - Other names: Thiophene-2-carboxylic acid hydrazide; 2-Thenoic hydrazide; Thiophene-2-carboxylic hydrazide; 2-Thiophenecarboxylic hydrazide; 2-Thenoylhydrazine; 2-Thienylcarboxylic acid hydrazide; 2-Thiophenecarbohydrazonic acid; 2-Thienyl hydrazide; NSC 653; Thiophene-2-carbohydrazide

Phase change data

Data compiled by: William E. Acree, Jr., James S. Chickos
Quantity | Value | Units | Method | Reference | Comment |
---|---|---|---|---|---|
ΔsubH° | 113.3 ± 0.5 | kJ/mol | ME | Ribeiro da Silva, Amaral, et al., 2008 | Based on data from 339. to 361. K. |
Enthalpy of sublimation
ΔsubH (kJ/mol) | Temperature (K) | Method | Reference | Comment |
---|---|---|---|---|
110.7 ± 0.5 | 350. | ME | Ribeiro da Silva, Amaral, et al., 2008 | Based on data from 339. to 361. K. |

References

Ribeiro da Silva, Amaral, et al., 2008
Ribeiro da Silva, Manuel A.V.; Amaral, Lui´sa M.P.F.; Santos, Ana Filipa L.O.M.,
Thermochemical and thermophysical study of 2-thiophenecarboxylic acid hydrazide and 2-furancarboxylic acid hydrazide,
The Journal of Chemical Thermodynamics, 2008, 40, 11, 1588-1593, https://doi.org/10.1016/j.jct.2008.06.011
. [all data]