Cyclooctane, 1,2-diethyl-
- Formula: C12H24
- Molecular weight: 168.3190
- IUPAC Standard InChIKey: XDADRYBKGCGTEX-UHFFFAOYSA-N
- CAS Registry Number: 23609-46-3
- Chemical structure:
View 3d structure (requires JavaScript / HTML 5) - Stereoisomers:
- Other names: 1,2-Diethylcyclooctane

Normal alkane RI, non-polar column, custom temperature program

Column type | Active phase | I | Reference | Comment |
---|---|---|---|---|
Capillary | Squalane | 1227. | Chen, 2008 | Program: not specified |

References

Chen, 2008
Chen, H.-F.,
Quantitative prediction of gas chromatography retention indices with support vector machines, radial basis neutral networks and multiple linear regression,
Anal. Chim. Acta, 2008, 609, 1, 24-36, https://doi.org/10.1016/j.aca.2008.01.003
. [all data]