1H-Cyclopenta[l]phenanthrene
- Formula: C17H12
- Molecular weight: 216.2772
- IUPAC Standard InChIKey: YQDSWSPIWVQKBC-UHFFFAOYSA-N
- CAS Registry Number: 235-92-7
- Chemical structure:
View 3d structure (requires JavaScript / HTML 5) - Permanent link for this species. Use this link for bookmarking this species for future reference.

Gas phase thermochemistry data

Data compiled by: Glushko Thermocenter, Russian Academy of Sciences, Moscow
Constant pressure heat capacity of gas
Cp,gas (J/mol*K) | Temperature (K) | Reference | Comment |
---|---|---|---|
45.86 | 50. | Dorofeeva O.V., 1989 | These statistically calculated values were obtained using force field approximation for polycyclic aromatic hydrocarbons to estimate the needed vibrational frequencies (see also [ Dorofeeva O.V., 1986, Moiseeva N.F., 1990]). These functions are reproduced in the reference book [ Frenkel M., 1994]. |
75.13 | 100. | ||
107.67 | 150. | ||
144.25 | 200. | ||
202.81 | 273.15 | ||
223.2 ± 2.0 | 298.15 | ||
224.65 | 300. | ||
301.48 | 400. | ||
366.06 | 500. | ||
417.95 | 600. | ||
459.55 | 700. | ||
493.32 | 800. | ||
521.10 | 900. | ||
544.22 | 1000. | ||
563.62 | 1100. | ||
580.03 | 1200. | ||
593.99 | 1300. | ||
605.92 | 1400. | ||
616.19 | 1500. |

References

Dorofeeva O.V., 1989
Dorofeeva O.V.,
Thermodynamic Properties of Gaseous Polycyclic Aromatic Hydrocarbons Containing Five-Membered Rings. Institute for High Temperatures, USSR Academy of Sciences, Preprint No.1-263 (in Russian), Moscow, 1989. [all data]
Dorofeeva O.V., 1986
Dorofeeva O.V.,
On calculation of thermodynamic properties of polycyclic aromatic hydrocarbons,
Thermochim. Acta, 1986, 102, 59-66. [all data]
Moiseeva N.F., 1990
Moiseeva N.F.,
Group additivity scheme for calculating the chemical thermodynamic properties of gaseous polycyclic aromatic hydrocarbons containing five-membered rings,
Thermochim. Acta, 1990, 168, 179-186. [all data]
Frenkel M., 1994
Frenkel M.,
Thermodynamics of Organic Compounds in the Gas State, Vol. I, II, Thermodynamics Research Center, College Station, Texas, 1994, 1994. [all data]