Pyridine, 3-ethyl-2,6-dimethyl-
- Formula: C9H13N
- Molecular weight: 135.2062
- IUPAC Standard InChIKey: VSLXJOHTVOZTNF-UHFFFAOYSA-N
- CAS Registry Number: 23580-52-1
- Chemical structure:
View 3d structure (requires JavaScript / HTML 5) - Other names: 2,6-Lutidine, 3-ethyl-; 2,6-Dimethyl-3-ethylpyridine; 3-Ethyl-2,6-dimethyl-pyridine

Kovats' RI, non-polar column, isothermal

Column type | Active phase | Temperature (C) | I | Reference | Comment |
---|---|---|---|---|---|
Packed | Apiezon L | 130. | 1110. | Shatts, Avots, et al., 1977 | He, Chromosorb W AW-DMCS; Column length: 2.4 m |

Normal alkane RI, polar column, custom temperature program

Column type | Active phase | I | Reference | Comment |
---|---|---|---|---|
Capillary | Carbowax | 1557. | Baltes and Bochmann, 1987 | Program: not specified |

References

Shatts, Avots, et al., 1977
Shatts, V.D.; Avots, A.A.; Belikov, V.A.,
Retention indices of alkylpyridines,
Zh. Anal. Khim., 1977, 32, 4, 631-638. [all data]
Baltes and Bochmann, 1987
Baltes, W.; Bochmann, G.,
Model reactions on roast aroma formations, V. Mass spectrometric identification of pyrifines, oxazoles, and carbocyclic compounds from the reaction of serine and threonine with sucrose under the conditions of coffee roasting,
Z. Lebensm. Unters. Forsch., 1987, 185, 1, 5-9, https://doi.org/10.1007/BF01083331
. [all data]