1,1'-Biphenyl, 4-ethenyl-
- Formula: C14H12
- Molecular weight: 180.2451
- IUPAC Standard InChIKey: HDBWAWNLGGMZRQ-UHFFFAOYSA-N
- CAS Registry Number: 2350-89-2
- Chemical structure:
View 3d structure (requires JavaScript / HTML 5) - Other names: Biphenyl, 4-vinyl-; p-Phenylstyrene; 4-Phenylstyrene; p-Vinylbiphenyl; 4-Vinylbiphenyl; 4-Vinyldiphenyl; 4-Ethenyl-1,1'-biphenyl

Phase change data

Data compiled by: Thermodynamics Research Center, NIST Boulder Laboratories, Chris Muzny director
Quantity | Value | Units | Method | Reference | Comment |
---|---|---|---|---|---|
Tfus | 392. | K | N/A | El'tsova, Koton, et al., 1960 | Uncertainty assigned by TRC = 4. K |
Tfus | 391. | K | N/A | Shabarov, Vasil'ev, et al., 1960 | Uncertainty assigned by TRC = 5. K |

References

El'tsova, Koton, et al., 1960
El'tsova, P.A.; Koton, M.M.; Mineeva, O.K.; Surnina, O.K.,
Synthesis of Vinyl Derivatives of Biphenyl, Diphenyl Oxide, and Diphenyl Sulfide,
Zh. Obshch. Khim., 1960, 30, 933-4. [all data]
Shabarov, Vasil'ev, et al., 1960
Shabarov, Yu.S.; Vasil'ev, N.I.; Mamaeva, N.K.; Levina, R.Ya.,
A New Method of Synthesis of 3-Aryl-1,4,5,6-tetrahydropyridazines. p-Biphenylcyclobutane,
Doklady Akad. Nauk S.S.S.R., 1960, 135, 879-82. [all data]