tert-butyl 2-buteneperoxoate
- Formula: C8H14O3
- Molecular weight: 158.1950
- IUPAC Standard InChIKey: CXOHVCKJGLFRKZ-AATRIKPKSA-N
- CAS Registry Number: 23474-91-1
- Chemical structure:
View 3d structure (requires JavaScript / HTML 5) - Other names: 2-Buteneperoxoic acid, 1,1-dimethylethyl ester

Condensed phase thermochemistry data

Data compiled by: Hussein Y. Afeefy, Joel F. Liebman, and Stephen E. Stein
Quantity | Value | Units | Method | Reference | Comment |
---|---|---|---|---|---|
ΔfH°liquid | -417. ± 5.4 | kJ/mol | Ccb | Zaikin, 1977 |

References

Zaikin, 1977
Zaikin, I.D.,
The dissociation energy of the peroxide linkage in peresters,
Russ. J. Phys. Chem. (Engl. Transl.), 1977, 51, 786-788. [all data]