3-Butynoic acid
- Formula: C4H4O2
- Molecular weight: 84.0734
- IUPAC Standard InChIKey: KKAHGSQLSTUDAV-UHFFFAOYSA-N
- CAS Registry Number: 2345-51-9
- Chemical structure:
View 3d structure (requires JavaScript / HTML 5) - Other names: CH≡CCH2COOH; but-3-ynoic acid

Reaction thermochemistry data

Data compiled by: Hussein Y. Afeefy, Joel F. Liebman, and Stephen E. Stein
Individual Reactions
By formula: 2H2 + C4H4O2 = C4H8O2
Quantity | Value | Units | Method | Reference | Comment |
---|---|---|---|---|---|
ΔrH° | -292.0 ± 0.84 | kJ/mol | Chyd | Flitcroft and Skinner, 1958 | solid phase; Reanalyzed by Cox and Pilcher, 1970, Original value = -303. ± 4.6 kJ/mol |

References

Flitcroft and Skinner, 1958
Flitcroft, T.L.; Skinner, H.A.,
Heats of hydrogenation Part 2.-Acetylene derivatives,
Trans. Faraday Soc., 1958, 54, 47-53. [all data]
Cox and Pilcher, 1970
Cox, J.D.; Pilcher, G.,
Thermochemistry of Organic and Organometallic Compounds, Academic Press, New York, 1970, 1-636. [all data]