2-Pentadecanone
- Formula: C15H30O
- Molecular weight: 226.3981
- IUPAC Standard InChIKey: CJPNOLIZCWDHJK-UHFFFAOYSA-N
- CAS Registry Number: 2345-28-0
- Chemical structure:
View 3d structure (requires JavaScript / HTML 5) - Other names: Methyl tridecyl ketone; Pentadecan-2-one; 2-pentandecanone

Condensed phase thermochemistry data

Data compiled by: Eugene S. Domalski and Elizabeth D. Hearing
Constant pressure heat capacity of solid
Cp,solid (cal/mol*K) | Temperature (K) | Reference | Comment |
---|---|---|---|
102.0 | 298.15 | Sunner, Svensson, et al., 1979 | T = 285 to 343 K. Equations only. |

Phase change data

Data compiled as indicated in comments:
BS - Robert L. Brown and Stephen E. Stein
TRC - Thermodynamics Research Center, NIST Boulder Laboratories, Chris Muzny director
AC - William E. Acree, Jr., James S. Chickos
DH - Eugene S. Domalski and Elizabeth D. Hearing
Quantity | Value | Units | Method | Reference | Comment |
---|---|---|---|---|---|
Tboil | 567.2 | K | N/A | Weast and Grasselli, 1989 | BS |
Quantity | Value | Units | Method | Reference | Comment |
Tfus | 312.2 | K | N/A | Sunner, Svensson, et al., 1979, 2 | Uncertainty assigned by TRC = 0.1 K; TRC |
Quantity | Value | Units | Method | Reference | Comment |
ΔvapH° | 20.4 ± 0.41 | kcal/mol | S-F | Sunner, Svensson, et al., 1979 | AC |
Quantity | Value | Units | Method | Reference | Comment |
ΔsubH° | 33.29 ± 0.38 | kcal/mol | C | Sunner, Svensson, et al., 1979 | AC |
Enthalpy of vaporization
ΔvapH (kcal/mol) | Temperature (K) | Method | Reference | Comment |
---|---|---|---|---|
16.2 | 437. | A | Stephenson and Malanowski, 1987 | Based on data from 422. to 575. K.; AC |
13.8 | 574. | A | Stephenson and Malanowski, 1987 | Based on data from 559. to 658. K.; AC |
Enthalpy of fusion
ΔfusH (kcal/mol) | Temperature (K) | Reference | Comment |
---|---|---|---|
13.043 | 312.2 | Sunner, Svensson, et al., 1979 | DH |
13.00 | 312.2 | Domalski and Hearing, 1996 | AC |
Entropy of fusion
ΔfusS (cal/mol*K) | Temperature (K) | Reference | Comment |
---|---|---|---|
41.78 | 312.2 | Sunner, Svensson, et al., 1979 | DH |

Van Den Dool and Kratz RI, non-polar column, temperature ramp

Data compiled by: NIST Mass Spectrometry Data Center, William E. Wallace, director

Column type CapillaryCapillaryCapillaryCapillaryCapillary
Active phase RTX-1HP-5MSSPB-5HP-5CP Sil 5 CB
Column length (m) 60.30.30.30.60.
Carrier gas HeHeHeHeHe
Substrate
Column diameter (mm) 0.220.250.530.250.32
Phase thickness (μm) 0.250.251.50.250.25
Tstart (C) 60.60.100.60.60.
Tend (C) 230.250.250.280.280.
Heat rate (K/min) 2.4.5.3.3.
Initial hold (min)  2.  10.
Final hold (min) 35.20.  60.
I 1682.1689.1703.1694.1682.
ReferencePaolini, Costa, et al., 2005Pino, Mesa, et al., 2005Rodríguez-Burruezo, Kollmannsberger, et al., 2004Fokialakis, Melliou, et al., 2003Pino, Almora, et al., 2003
Comment MSDC-RI MSDC-RI MSDC-RI MSDC-RI MSDC-RI
Column type CapillaryCapillaryCapillaryCapillaryCapillary
Active phase BPX-5CP Sil 5 CBCP Sil 8 CBOV-1OV-1
Column length (m) 50.50.60.20.20.
Carrier gas HeHeHeHeHe
Substrate
Column diameter (mm) 0.320.320.250.320.32
Phase thickness (μm) 0.250.40.250.30.3
Tstart (C) 35.60.40.45.45.
Tend (C) 250.280.280.220.220.
Heat rate (K/min) 4.3.4.10.10.
Initial hold (min) 3.10.2.5.5.
Final hold (min) 10.60. 10.10.
I 1705.1682.1702.1671.1671.
ReferenceOruna-Concha, Duckham, et al., 2001Pino, Marbot, et al., 2001Elmore, Mottram, et al., 2000Valero, Sanz, et al., 1999Valero, Sanz, et al., 1999
Comment MSDC-RI MSDC-RI MSDC-RI MSDC-RI MSDC-RI
Column type CapillaryCapillaryPackedCapillary
Active phase SE-30DB-5OV-101OV-1
Column length (m) 22.30.2.5183.
Carrier gas N2He N2
Substrate   Gas-Chrom Q
Column diameter (mm) 0.300.26
Phase thickness (μm) 1.00.25
Tstart (C) 60.50.50.0.
Tend (C) 250.300.220.230.
Heat rate (K/min) 2.6.2.1.
Initial hold (min)  4.
Final hold (min)  20.
I 1676.1699.1685.1681.
Referencede Frutos, Sanz, et al., 1991Rostad and Pereira, 1986Nixon, Wong, et al., 1979Schreyen, Dirinck, et al., 1976
Comment MSDC-RI MSDC-RI MSDC-RI MSDC-RI

Van Den Dool and Kratz RI, polar column, temperature ramp

Data compiled by: NIST Mass Spectrometry Data Center, William E. Wallace, director

Column type CapillaryCapillaryCapillaryCapillaryCapillary
Active phase ZB-WaxRTX-WaxZB-WaxAT-WaxCP-Wax 52CB
Column length (m) 30.60.30.60.50.
Carrier gas HeHeHeHeH2
Substrate
Column diameter (mm) 0.250.220.250.320.32
Phase thickness (μm) 0.150.250.150.25
Tstart (C) 35.60.35.65.50.
Tend (C) 220.230.220.250.200.
Heat rate (K/min) 5.2.5.2.2.
Initial hold (min) 5. 5.10.
Final hold (min) 10.35.10.60.
I 2019.2010.2019.1996.2002.
ReferenceLedauphin, Basset, et al., 2006Paolini, Costa, et al., 2005Ledauphin, Saint-Clair, et al., 2004Pino, Almora, et al., 2003Liu, Yang, et al., 2001
Comment MSDC-RI MSDC-RI MSDC-RI MSDC-RI MSDC-RI
Column type CapillaryCapillaryCapillaryCapillaryCapillary
Active phase AT-WaxDB-WaxSupelcowax-10DB-WaxDB-Wax
Column length (m) 60.60.60.30.60.
Carrier gas HeHeHeHeHe
Substrate
Column diameter (mm) 0.320.250.250.250.25
Phase thickness (μm) 0.250.250.250.250.25
Tstart (C) 65.50.35.20.50.
Tend (C) 250.230.195.200.230.
Heat rate (K/min) 2.2.2.4.2.
Initial hold (min) 10. 5.5.
Final hold (min) 60.60.90.10.60.
I 1997.2041.2027.2021.2028.
ReferencePino, Marbot, et al., 2001Shimoda, Yoshimura, et al., 2001Chung, 1999Ott, Fay, et al., 1997Shiratsuchi, Shimoda, et al., 1994
Comment MSDC-RI MSDC-RI MSDC-RI MSDC-RI MSDC-RI
Column type Capillary
Active phase Carbowax 20M
Column length (m) 60.
Carrier gas He
Substrate
Column diameter (mm) 0.32
Phase thickness (μm)
Tstart (C) 50.
Tend (C) 225.
Heat rate (K/min) 1.5
Initial hold (min)
Final hold (min) 80.
I 2016.
ReferenceChen and Ho, 1988
Comment MSDC-RI

Normal alkane RI, polar column, temperature ramp

Data compiled by: NIST Mass Spectrometry Data Center, William E. Wallace, director

Column type CapillaryCapillaryCapillaryCapillaryCapillary
Active phase TC-FFAPDB-WaxDB-WaxDB-WaxDB-Wax
Column length (m) 60.30.30.60.60.
Carrier gas He  H2
Substrate
Column diameter (mm) 0.250.250.250.320.25
Phase thickness (μm) 0.40.250.250.25
Tstart (C) 60.30.30.60.60.
Tend (C) 220.250.250.220.220.
Heat rate (K/min) 3.4.4.3.3.
Initial hold (min)  1.1. 4.
Final hold (min) 30.
I 2029.2023.2023.2031.2056.
ReferenceKurose and Yatagai, 2005Tanaka, Yamauchi, et al., 2003Tanaka, Yamauchi, et al., 2003Werkhoff, Güntert, et al., 1998Chung, Eiserich, et al., 1993
Comment MSDC-RI MSDC-RI MSDC-RI MSDC-RI MSDC-RI
Column type CapillaryCapillaryCapillary
Active phase Carbowax 20MSP-1000DB-Wax
Column length (m) 50.25.60.
Carrier gas HeN2
Substrate
Column diameter (mm) 0.250.20.32
Phase thickness (μm)  0.43
Tstart (C) 60.60.50.
Tend (C) 180.190.250.
Heat rate (K/min) 2.4.4.
Initial hold (min) 4. 0.1
Final hold (min)  30.5.
I 1995.2017.2018.
ReferenceKawakami and Kobayashi, 1991De Llano D.G., Ramos M., et al., 1990Binder and Flath, 1989
Comment MSDC-RI MSDC-RI MSDC-RI

Normal alkane RI, polar column, custom temperature program

Data compiled by: NIST Mass Spectrometry Data Center, William E. Wallace, director

Column type CapillaryCapillaryCapillaryCapillaryCapillary
Active phase HP InnowaxHP-Innowax FSCDB-WaxSupelcowax 10Supelcowax 10
Column length (m) 50.60.60.60.60.
Carrier gas HeliumHeN2HeliumHelium
Substrate
Column diameter (mm) 0.200.25 0.250.25
Phase thickness (μm) 0.250.250.250.250.25
Program 40 0C (5 min) 2 0C/min -> 270 0C -> 260 0C (20 min)60C(10min) => 4C/min => 220C(10min) => 1C/min => 240Cnot specified60 0C (10 min) 2 0C/min -> 80 0C 3 0C/min -> 100 0C 4 0C/min -> 220 0C (30 min)not specified
I 2031.2025.1998.2014.2010.
ReferenceMancini, Arnold, et al., 2009Erdemoglu, Sener, et al., 2003Weyerstahl, Marschall, et al., 1998Castioni and Kapetanidis, 1996Castioni and Kapetanidis, 1996
Comment MSDC-RI MSDC-RI MSDC-RI MSDC-RI MSDC-RI
Column type CapillaryCapillaryCapillary
Active phase Supelcowax 10DB-WaxCarbowax 20M
Column length (m) 60.60.
Carrier gas Helium He
Substrate
Column diameter (mm) 0.250.32
Phase thickness (μm) 0.25
Program not specifiednot specifiednot specified
I 2023.2020.2011.
ReferenceCastioni and Kapetanidis, 1996Binder and Flath, 1989Peppard and Ramus, 1988
Comment MSDC-RI MSDC-RI MSDC-RI

Kovats' RI, non-polar column, isothermal

Data compiled by: NIST Mass Spectrometry Data Center, William E. Wallace, director

Column type PackedCapillaryCapillaryCapillaryPacked
Active phase OV-101SE-30SE-30ApolaneApolane
Column length (m) 2.27.27.43.2.
Carrier gas N2N2N2N2N2
Substrate Chromosorb G HPChromosorb G HPChromosorb G HP Chromosorb G HP
Column diameter (mm)  0.40.40.290.29
Phase thickness (μm)  1.130.10.280.28
Temperature (C) 220.220.200.220.220.
I 1690.91685.61687.91678.11666.6
ReferenceDidaoui, Touabet, et al., 1997Didaoui, Touabet, et al., 1997Didaoui, Touabet, et al., 1997Didaoui, Touabet, et al., 1997Didaoui, Touabet, et al., 1997
Comment MSDC-RI MSDC-RI MSDC-RI MSDC-RI MSDC-RI

Normal alkane RI, non-polar column, isothermal

Data compiled by: NIST Mass Spectrometry Data Center, William E. Wallace, director

Column type Capillary
Active phase OV-1
Column length (m)
Carrier gas
Substrate
Column diameter (mm)
Phase thickness (μm)
Temperature (C) 60.
I 1670.
ReferenceAmboni, Junkes, et al., 2002
Comment MSDC-RI

Van Den Dool and Kratz RI, polar column, custom temperature program

Data compiled by: NIST Mass Spectrometry Data Center, William E. Wallace, director

Column type CapillaryCapillary
Active phase CP-Wax 52CBSupelcowax-10
Column length (m) 60.60.
Carrier gas HeHe
Substrate
Column diameter (mm) 0.250.25
Phase thickness (μm) 0.250.25
Program 45C(5min) => 10C/min => 80C => 2C/min => 240C20C(0.5min) => 60C => 4C/min => 250C
I 2023.1997.
ReferenceVerzera, Ziino, et al., 2004Sing, Smadja, et al., 1992
Comment MSDC-RI MSDC-RI

References

Sunner, Svensson, et al., 1979
Sunner, S.; Svensson, Ch.; Zelepuga, A.S.,
Enthalpies of vaporization at 298.15 K for some 2-alkanones and methyl alkanoates,
J. Chem. Thermodyn., 1979, 11, 491-495. [all data]
Weast and Grasselli, 1989
CRC Handbook of Data on Organic Compounds, 2nd Editon, Weast,R.C and Grasselli, J.G., ed(s)., CRC Press, Inc., Boca Raton, FL, 1989, 1. [all data]
Sunner, Svensson, et al., 1979, 2
Sunner, S.; Svensson, C.; Zelepuga, A.S.,
Enthalpies of Vaporization at 298.15 for Some 2-ALkanones and Methyl Alkanoates,
J. Chem. Thermodyn., 1979, 11, 491-5. [all data]
Stephenson and Malanowski, 1987
Stephenson, Richard M.; Malanowski, Stanislaw,
Handbook of the Thermodynamics of Organic Compounds, 1987, https://doi.org/10.1007/978-94-009-3173-2
. [all data]
Domalski and Hearing, 1996
Domalski, Eugene S.; Hearing, Elizabeth D.,
Heat Capacities and Entropies of Organic Compounds in the Condensed Phase. Volume III,
J. Phys. Chem. Ref. Data, 1996, 25, 1, 1, https://doi.org/10.1063/1.555985
. [all data]