2-Tetradecanone
- Formula: C14H28O
- Molecular weight: 212.3715
- IUPAC Standard InChIKey: POQLVOYRGNFGRM-UHFFFAOYSA-N
- CAS Registry Number: 2345-27-9
- Chemical structure:
View 3d structure (requires JavaScript / HTML 5) - Other names: tetradecan-2-one

Condensed phase thermochemistry data

Data compiled by: Eugene S. Domalski and Elizabeth D. Hearing
Constant pressure heat capacity of solid
Cp,solid (J/mol*K) | Temperature (K) | Reference | Comment |
---|---|---|---|
415.2 | 298.15 | Sunner, Svensson, et al., 1979 | T = 278 to 338 K. Equations only. |

Phase change data

Data compiled as indicated in comments:
BS - Robert L. Brown and Stephen E. Stein
TRC - Thermodynamics Research Center, NIST Boulder Laboratories, Chris Muzny director
AC - William E. Acree, Jr., James S. Chickos
DH - Eugene S. Domalski and Elizabeth D. Hearing
Quantity | Value | Units | Method | Reference | Comment |
---|---|---|---|---|---|
Tfus | 306.7 | K | N/A | Sunner, Svensson, et al., 1979, 2 | Uncertainty assigned by TRC = 0.1 K; TRC |
Quantity | Value | Units | Method | Reference | Comment |
Tc | 727.7 | K | N/A | Pulliam, Gude, et al., 1995 | Uncertainty assigned by TRC = 4.8 K; TRC |
Quantity | Value | Units | Method | Reference | Comment |
ρc | 1.12 | mol/l | N/A | Pulliam, Gude, et al., 1995 | Uncertainty assigned by TRC = 0.03 mol/l; TRC |
Quantity | Value | Units | Method | Reference | Comment |
ΔvapH° | 82.1 ± 0.6 | kJ/mol | S-F | Sunner, Svensson, et al., 1979 | AC |
Quantity | Value | Units | Method | Reference | Comment |
ΔsubH° | 130.9 ± 0.5 | kJ/mol | C | Sunner, Svensson, et al., 1979 | AC |
Reduced pressure boiling point
Tboil (K) | Pressure (bar) | Reference | Comment |
---|---|---|---|
478.7 | 0.133 | Weast and Grasselli, 1989 | BS |
407.2 | 0.017 | Weast and Grasselli, 1989 | BS |
Enthalpy of vaporization
ΔvapH (kJ/mol) | Temperature (K) | Method | Reference | Comment |
---|---|---|---|---|
65.6 | 426. | A | Stephenson and Malanowski, 1987 | Based on data from 411. to 560. K.; AC |
55.6 | 564. | A | Stephenson and Malanowski, 1987 | Based on data from 549. to 643. K.; AC |
64.4 | 387. | A | Stephenson and Malanowski, 1987 | Based on data from 372. to 551. K. See also Stull, 1947.; AC |
51.6 | 556. | N/A | Ambrose, Ellender, et al., 1975 | Based on data from 412. to 643. K.; AC |
Enthalpy of fusion
ΔfusH (kJ/mol) | Temperature (K) | Reference | Comment |
---|---|---|---|
49.120 | 306.7 | Sunner, Svensson, et al., 1979 | DH |
49.12 | 306.7 | Domalski and Hearing, 1996 | AC |
Entropy of fusion
ΔfusS (J/mol*K) | Temperature (K) | Reference | Comment |
---|---|---|---|
160.2 | 306.7 | Sunner, Svensson, et al., 1979 | DH |

Normal alkane RI, non-polar column, custom temperature program

Data compiled by: NIST Mass Spectrometry Data Center, William E. Wallace, director

Column type CapillaryCapillaryCapillaryCapillaryCapillary
Active phase TR-5 MSPolydimethyl siloxane with 5 % Ph groupsPolydimethyl siloxane with 5 % Ph groupsSE-30Polydimethyl siloxane
Column length (m) 15.
Carrier gas Helium
Substrate
Column diameter (mm) 0.25
Phase thickness (μm) 0.25
Program 35 0C (3 min) 2 0C/min -> 60 0C (3 min) 2 0C/min -> 80 0C (3 min) 4 0C/min -> 120 0C (3 min) 5 0C/min -> 150 0C (3 min) 15 0C/min -> 240 0C (10 min)not specifiednot specifiednot specifiednot specified
I 1595.1597.1600.1580.1570.
ReferenceKurashov, Mitrukova, et al., 2014Robinson, Adams, et al., 2012Robinson, Adams, et al., 2012Vinogradov, 2004Junkes, Castanho, et al., 2003
Comment MSDC-RI MSDC-RI MSDC-RI MSDC-RI MSDC-RI

Van Den Dool and Kratz RI, non-polar column, temperature ramp

Data compiled by: NIST Mass Spectrometry Data Center, William E. Wallace, director

Column type CapillaryCapillary
Active phase DB-1DB-5
Column length (m) 60.30.
Carrier gas H2He
Substrate
Column diameter (mm) 0.250.26
Phase thickness (μm) 0.250.25
Tstart (C) 50.50.
Tend (C) 250.300.
Heat rate (K/min) 2.56.
Initial hold (min) 5.4.
Final hold (min)  20.
I 1569.1597.
ReferenceStashenko, Villa, et al., 1995Rostad and Pereira, 1986
Comment MSDC-RI MSDC-RI

Normal alkane RI, non-polar column, temperature ramp

Data compiled by: NIST Mass Spectrometry Data Center, William E. Wallace, director

Column type CapillaryCapillary
Active phase Cross-Linked MethylsiliconeOV-101
Column length (m) 25.54.
Carrier gas HeHelium
Substrate
Column diameter (mm) 0.320.26
Phase thickness (μm)
Tstart (C) 35.50.
Tend (C) 225.240.
Heat rate (K/min) 4.5.
Initial hold (min) 3.0.
Final hold (min)  0.
I 1578.1594.
ReferenceBravo and Hotchkiss, 1993Zenkevich and Ventura, 1991
Comment MSDC-RI MSDC-RI

Normal alkane RI, polar column, custom temperature program

Data compiled by: NIST Mass Spectrometry Data Center, William E. Wallace, director

Column type CapillaryCapillary
Active phase Carbowax 20MHP-Innowax FSC
Column length (m)  60.
Carrier gas  He
Substrate
Column diameter (mm)  0.25
Phase thickness (μm)  0.25
Program not specified60C (10min) => 4C/min => 220C (10min) => 1C/min => 240C
I 1893.1878.
ReferenceVinogradov, 2004Demirci, Baser, et al., 2003
Comment MSDC-RI MSDC-RI

References

Sunner, Svensson, et al., 1979
Sunner, S.; Svensson, Ch.; Zelepuga, A.S.,
Enthalpies of vaporization at 298.15 K for some 2-alkanones and methyl alkanoates,
J. Chem. Thermodyn., 1979, 11, 491-495. [all data]
Sunner, Svensson, et al., 1979, 2
Sunner, S.; Svensson, C.; Zelepuga, A.S.,
Enthalpies of Vaporization at 298.15 for Some 2-ALkanones and Methyl Alkanoates,
J. Chem. Thermodyn., 1979, 11, 491-5. [all data]
Pulliam, Gude, et al., 1995
Pulliam, M.K.; Gude, M.T.; Teja, A.S.,
Critical Temperatures and Densities of n-Alkanones,
J. Chem. Eng. Data, 1995, 40, 455-8. [all data]
Weast and Grasselli, 1989
CRC Handbook of Data on Organic Compounds, 2nd Editon, Weast,R.C and Grasselli, J.G., ed(s)., CRC Press, Inc., Boca Raton, FL, 1989, 1. [all data]
Stephenson and Malanowski, 1987
Stephenson, Richard M.; Malanowski, Stanislaw,
Handbook of the Thermodynamics of Organic Compounds, 1987, https://doi.org/10.1007/978-94-009-3173-2
. [all data]
Stull, 1947
Stull, Daniel R.,
Vapor Pressure of Pure Substances. Organic and Inorganic Compounds,
Ind. Eng. Chem., 1947, 39, 4, 517-540, https://doi.org/10.1021/ie50448a022
. [all data]
Ambrose, Ellender, et al., 1975
Ambrose, D.; Ellender, J.H.; Lees, E.B.; Sprake, C.H.S.; Townsend, R.,
Thermodynamic properties of organic oxygen compounds XXXVIII. Vapour pressures of some aliphatic ketones,
The Journal of Chemical Thermodynamics, 1975, 7, 5, 453-472, https://doi.org/10.1016/0021-9614(75)90275-X
. [all data]
Domalski and Hearing, 1996
Domalski, Eugene S.; Hearing, Elizabeth D.,
Heat Capacities and Entropies of Organic Compounds in the Condensed Phase. Volume III,
J. Phys. Chem. Ref. Data, 1996, 25, 1, 1, https://doi.org/10.1063/1.555985
. [all data]