4-Octanol, 4-methyl-
- Formula: C9H20O
- Molecular weight: 144.2545
- IUPAC Standard InChIKey: RXSIKQJQLQRQQY-UHFFFAOYSA-N
- CAS Registry Number: 23418-37-3
- Chemical structure:
View 3d structure (requires JavaScript / HTML 5) - Other names: 4-Methyl-4-octanol

Phase change data

Data compiled by: Thermodynamics Research Center, NIST Boulder Laboratories, Chris Muzny director
Quantity | Value | Units | Method | Reference | Comment |
---|---|---|---|---|---|
Tboil | 453.15 | K | N/A | Woodburn, 1931 | Uncertainty assigned by TRC = 3. K |
Tboil | 453.65 | K | N/A | Clarke, 1912 | Uncertainty assigned by TRC = 3. K |

References

Woodburn, 1931
Woodburn, H.M.,
, Thesis, Penn. State Univ., Univ. Park, PA, 1931. [all data]
Clarke, 1912
Clarke, L.,
4-Methyloctane,
J. Am. Chem. Soc., 1912, 34, 680. [all data]