Benzeneacetonitrile, 3-(trifluoromethyl)-
- Formula: C9H6F3N
- Molecular weight: 185.1458
- IUPAC Standard InChIKey: JOIYKSLWXLFGGR-UHFFFAOYSA-N
- CAS Registry Number: 2338-76-3
- Chemical structure:
View 3d structure (requires JavaScript / HTML 5) - Other names: Acetonitrile, (α,α,α-trifluoro-m-tolyl)-; (α,α,α-Trifluoro-m-tolyl)acetonitrile; m-(Trifluoromethyl)benzylcyanide; m-Trifluoromethylphenylacetonitrile; [3-(Trifluoromethyl)phenyl]acetonitrile; 3-(Trifluoromethyl)benzeneacetonitrile; 3-(Trifluoromethyl)benzyl cyanide; 3-Trifluormethylbenzylcyanide

Phase change data

Data compiled by: Robert L. Brown and Stephen E. Stein
Reduced pressure boiling point
Tboil (K) | Pressure (bar) | Reference |
---|---|---|
365.7 | 0.005 | Aldrich Chemical Company Inc., 1990 |
365. to 366. | 0.005 | PCR Inc., 1990 |

Reaction thermochemistry data

Data compiled by: John E. Bartmess
Individual Reactions
C9H5F3N- + =
By formula: C9H5F3N- + H+ = C9H6F3N
Quantity | Value | Units | Method | Reference | Comment |
---|---|---|---|---|---|
ΔrH° | 1431. ± 10. | kJ/mol | G+TS | Taft and Topsom, 1987 | gas phase |
Quantity | Value | Units | Method | Reference | Comment |
ΔrG° | 1403. ± 8.4 | kJ/mol | IMRE | Taft and Topsom, 1987 | gas phase |

Gas phase ion energetics data

Data compiled by: John E. Bartmess
De-protonation reactions
C9H5F3N- + =
By formula: C9H5F3N- + H+ = C9H6F3N
Quantity | Value | Units | Method | Reference | Comment |
---|---|---|---|---|---|
ΔrH° | 1431. ± 10. | kJ/mol | G+TS | Taft and Topsom, 1987 | gas phase |
Quantity | Value | Units | Method | Reference | Comment |
ΔrG° | 1403. ± 8.4 | kJ/mol | IMRE | Taft and Topsom, 1987 | gas phase |

References

Aldrich Chemical Company Inc., 1990
Aldrich Chemical Company Inc.,
Catalog Handbook of Fine Chemicals, Aldrich Chemical Company, Inc., Milwaukee WI, 1990, 1. [all data]
PCR Inc., 1990
PCR Inc.,
Research Chemicals Catalog 1990-1991, PCR Inc., Gainesville, FL, 1990, 1. [all data]
Taft and Topsom, 1987
Taft, R.W.; Topsom, R.D.,
The Nature and Analysis of Substituent Effects,
Prog. Phys. Org. Chem., 1987, 16, 1. [all data]