4-(Trifluoromethyl)phenylacetonitrile
- Formula: C9H6F3N
- Molecular weight: 185.1458
- IUPAC Standard InChIKey: QNKOCFJZJWOXDE-UHFFFAOYSA-N
- CAS Registry Number: 2338-75-2
- Chemical structure:
View 3d structure (requires JavaScript / HTML 5) - Other names: p-Trifluoromethylphenylacetonitrile; Benzeneacetonitrile, 4-(trifluoromethyl)-

Phase change data

Data compiled by: Robert L. Brown and Stephen E. Stein
Reduced pressure boiling point
Tboil (K) | Pressure (bar) | Reference |
---|---|---|
383. to 385. | 0.016 | PCR Inc., 1990 |

Reaction thermochemistry data

Data compiled by: John E. Bartmess
Individual Reactions
C9H5F3N- + =
By formula: C9H5F3N- + H+ = C9H6F3N
Quantity | Value | Units | Method | Reference | Comment |
---|---|---|---|---|---|
ΔrH° | 1420. ± 10. | kJ/mol | G+TS | Taft and Topsom, 1987 | gas phase |
Quantity | Value | Units | Method | Reference | Comment |
ΔrG° | 1393. ± 8.4 | kJ/mol | IMRE | Taft and Topsom, 1987 | gas phase |

Gas phase ion energetics data

Data compiled by: John E. Bartmess
De-protonation reactions
C9H5F3N- + =
By formula: C9H5F3N- + H+ = C9H6F3N
Quantity | Value | Units | Method | Reference | Comment |
---|---|---|---|---|---|
ΔrH° | 1420. ± 10. | kJ/mol | G+TS | Taft and Topsom, 1987 | gas phase |
Quantity | Value | Units | Method | Reference | Comment |
ΔrG° | 1393. ± 8.4 | kJ/mol | IMRE | Taft and Topsom, 1987 | gas phase |

References

PCR Inc., 1990
PCR Inc.,
Research Chemicals Catalog 1990-1991, PCR Inc., Gainesville, FL, 1990, 1. [all data]
Taft and Topsom, 1987
Taft, R.W.; Topsom, R.D.,
The Nature and Analysis of Substituent Effects,
Prog. Phys. Org. Chem., 1987, 16, 1. [all data]