1-Butene, 1-chloro-2-methyl-
- Formula: C5H9Cl
- Molecular weight: 104.578
- IUPAC Standard InChIKey: KRGLOJFYIVYYDI-SNAWJCMRSA-N
- CAS Registry Number: 23378-11-2
- Chemical structure:
- Other names: 1-Chloro-2-methyl-1-butene, trans

Normal alkane RI, non-polar column, isothermal

Column type | Active phase | Temperature (C) | I | Reference | Comment |
---|---|---|---|---|---|
Capillary | Squalane | 30. | 712. | Tourres, 1968 | Nitrogen; Column length: 50. m; Column diameter: 0.25 mm |
Capillary | Squalane | 50. | 715. | Tourres, 1968 | Nitrogen; Column length: 50. m; Column diameter: 0.25 mm |

References

Tourres, 1968
Tourres, D.A.,
Separation of mono- and dichloro-methyl butanes and of monochloro-methyl butenes by preparative gas chromatography,
Chromatographia, 1968, 1, 11-12, 437-442, https://doi.org/10.1007/BF02255759
. [all data]