Methyl 2-butynoate
- Formula: C5H6O2
- Molecular weight: 98.0999
- IUPAC Standard InChIKey: UJQCANQILFWSDJ-UHFFFAOYSA-N
- CAS Registry Number: 23326-27-4
- Chemical structure:
View 3d structure (requires JavaScript / HTML 5) - Other names: Methyl tetrolate; 2-Butynoic acid, methyl ester

Phase change data

Data compiled by: Robert L. Brown and Stephen E. Stein
Reduced pressure boiling point
Tboil (K) | Pressure (bar) | Reference |
---|---|---|
349.7 | 0.11 | Aldrich Chemical Company Inc., 1990 |
349. to 350. | 0.11 | Farchan Laboratories, 1990 |

References

Aldrich Chemical Company Inc., 1990
Aldrich Chemical Company Inc.,
Catalog Handbook of Fine Chemicals, Aldrich Chemical Company, Inc., Milwaukee WI, 1990, 1. [all data]
Farchan Laboratories, 1990
Farchan Laboratories,
Research Chemicals Catalog, Farchan Laboratories, Gainesville, FL, 1990, 91. [all data]