Naphtho[2,1-b]thiophene
- Formula: C12H8S
- Molecular weight: 184.257
- IUPAC Standard InChIKey: LJOLGGXHRVADAA-UHFFFAOYSA-N
- CAS Registry Number: 233-02-3
- Chemical structure:
View 3d structure (requires JavaScript / HTML 5) - Other names: Naphtho[2.1-b]thiophene

Lee's RI, non-polar column, temperature ramp

Column type | Active phase | I | Reference | Comment |
---|---|---|---|---|
Capillary | Rxi-5 MS | 300.00 | Zeigler, Schantz, et al., 2012 | 30. m/0.25 mm/0.25 μm, Helium, 60. C @ 1. min, 5. K/min, 340. C @ 0. min |
Capillary | DB-5 | 300.31 | Williams and Bottrill, 1995 | He, 60. C @ 2. min, 5. K/min; Column length: 25. m; Column diameter: 0.3 mm; Tend: 270. C |
Capillary | SE-52 | 300.00 | Kong, Lee, et al., 1982 | H2, 8. K/min; Column length: 19.6 m; Column diameter: 0.32 mm; Tstart: 40. C; Tend: 280. C |
Capillary | SE-52 | 300.00 | Vassilaros, Kong, et al., 1982 | 20. m/0.30 mm/0.25 μm, H2, 40. C @ 2. min, 4. K/min; Tend: 265. C |

Lee's RI, non-polar column, custom temperature program

Column type | Active phase | I | Reference | Comment |
---|---|---|---|---|
Capillary | SPB-5 | 299.03 | Thuss, Popp, et al., 2000 | 60. m/0.32 mm/0.10 μm, He; Program: A: 105 0C (2 min) 2.5 0C -> 230 0C 50 0C/min -> 305 0C (15 min) B: 95 0C (2 min) 3.8 0C/min -> 310 0C (5 min) |
Capillary | DB-5 | 299.79 | Mössner, de Alda, et al., 1999 | 60. m/0.25 mm/0.25 μm, He; Program: 60C (1 min) => 45 C/min => 150C (2 min) => 2 C/min => 300 C (25 min) |
Capillary | HP-5 | 300.0 | Becker, Nilsson, et al., 1998 | 50. m/0.32 mm/0.5 μm, He; Program: 35C => 25C/min => 160C => 3C/min => 300C(50min) |
Capillary | DB-5 | 299.41 | Zamperlini, Silva, et al., 1997 | 30. m/0.25 mm/0.25 μm, He; Program: 90C (1min) => 10C/min => 120C => 4C/min => 310C (20min) |

References

Zeigler, Schantz, et al., 2012
Zeigler, C.; Schantz, M.; Wise, S.; Robbat, A.,
Mass spectra and retention indices for polycyclic aromatic sulfur heterocycles and some alkylated analogs,
Polycyclic Aromatic Compounds, 2012, 32, 2, 154-176, https://doi.org/10.1080/10406638.2011.651679
. [all data]
Williams and Bottrill, 1995
Williams, P.T.; Bottrill, R.P.,
Sulfur-polycyclic aromatic hydrocarbons in tyre pyrolysis oil,
Fuel, 1995, 74, 5, 736-742, https://doi.org/10.1016/0016-2361(94)00005-C
. [all data]
Kong, Lee, et al., 1982
Kong, R.C.; Lee, M.L.; Tominaga, Y.; Pratap, R.; Iwao, M.; Castle, R.N.; Wise, S.A.,
Capillary Column Gas Chromatographic Resolution of Isomeric Polycylic Aromatic Sulfur Heterocycles in a Coal Liquid,
J. Chromatogr. Sci., 1982, 20, 11, 502-510, https://doi.org/10.1093/chromsci/20.11.502
. [all data]
Vassilaros, Kong, et al., 1982
Vassilaros, D.L.; Kong, R.C.; Later, D.W.; Lee, M.L.,
Linear retention index system for polycyclic aromatic compounds. Critical evaluation and additional indices,
J. Chromatogr., 1982, 252, 1-20, https://doi.org/10.1016/S0021-9673(01)88394-1
. [all data]
Thuss, Popp, et al., 2000
Thuss, U.; Popp, P.; Ehrlich, C.; Kalkoff, W.-D.,
Identification and quantification of thaarenes in the flue gas of lignite-fired domestic heating,
J. Hi. Res. Chromatogr., 2000, 23, 7/8, 457-473, https://doi.org/10.1002/1521-4168(20000801)23:7/8<457::AID-JHRC457>3.0.CO;2-7
. [all data]
Mössner, de Alda, et al., 1999
Mössner, S.G.; de Alda, M.J.L.; Sander, L.C.; Lee, M.L.; Wise, S.A.,
Gas chromatographic retention behavior of polycyclic aromatic sulfur heterocyclic compounds, (dibenzothiophene, naphtho[b]thiophenes, benzo[b]naphthothiophenes and alkyl-substituted derivatives) on stationary phases of different selectivity,
J. Chromatogr. A, 1999, 841, 2, 207-228, https://doi.org/10.1016/S0021-9673(99)00363-5
. [all data]
Becker, Nilsson, et al., 1998
Becker, G.; Nilsson, U.; Colmsjö, A.; Östman, C.,
Determination of polycyclic aromatic sulfur heterocyclic compounds in airborne particulate by gas chromatography with atomic emission and mass spectrometric detection,
J. Chromatogr. A, 1998, 826, 1, 57-66, https://doi.org/10.1016/S0021-9673(98)00729-8
. [all data]
Zamperlini, Silva, et al., 1997
Zamperlini, G.C.M.; Silva, M.R.S.; Vilegas, W.,
Identification of polycyclic aromatic hydrocarbons in sugar cane soot by gas chromatography-mass spectrometry,
Chromatographia, 1997, 46, 11/12, 655-663, https://doi.org/10.1007/BF02490527
. [all data]