Benzoic acid, 2-hydroxy-3-methyl-, methyl ester
- Formula: C9H10O3
- Molecular weight: 166.1739
- IUPAC Standard InChIKey: SUHLUMKZPUMAFP-UHFFFAOYSA-N
- CAS Registry Number: 23287-26-5
- Chemical structure:
View 3d structure (requires JavaScript / HTML 5) - Other names: 2,3-Cresotic acid, methyl ester; Methyl o-cresotinate; Methyl 2-hydroxy-3-methylbenzoate; Methyl 3-methylsalicylate; Methyl ester of 2-hydroxy-3-methylbenzoic acid

Phase change data

Data compiled by: Robert L. Brown and Stephen E. Stein
Quantity | Value | Units | Method | Reference | Comment |
---|---|---|---|---|---|
Tboil | 508.2 | K | N/A | Weast and Grasselli, 1989 |
Reduced pressure boiling point
Tboil (K) | Pressure (bar) | Reference |
---|---|---|
384.2 | 0.017 | Weast and Grasselli, 1989 |
389. to 391. | 0.024 | Frinton Laboratories Inc., 1986 |

References

Weast and Grasselli, 1989
CRC Handbook of Data on Organic Compounds, 2nd Editon, Weast,R.C and Grasselli, J.G., ed(s)., CRC Press, Inc., Boca Raton, FL, 1989, 1. [all data]
Frinton Laboratories Inc., 1986
Frinton Laboratories Inc.,
Catalog Number 11, Frinton Laboratories Inc., Vineland, NJ, 1986, 99. [all data]