Cyclohexanol, 5-methyl-2-(1-methylethyl)-, [1S-(1α,2β,5β)]-
- Formula: C10H20O
- Molecular weight: 156.2652
- IUPAC Standard InChIKey: NOOLISFMXDJSKH-LPEHRKFASA-N
- CAS Registry Number: 23283-97-8
- Chemical structure:
View 3d structure (requires JavaScript / HTML 5) - Stereoisomers:
- Cyclohexanol, 5-methyl-2-(1-methylethyl)-
- Cyclohexanol, 5-methyl-2-(1-methylethyl)-, (1α,2β,5α)-
- Cyclohexanol, 5-methyl-2-(1-methylethyl)-, [1R-(1α,2α,5β)]-
- Levomenthol
- Cyclohexanol, 5-methyl-2-(1-methylethyl)-, [1S-(1α,2α,5β)]-
- Cyclohexanol, 5-methyl-2-(1-methylethyl)-, (1α,2β,5β)-
- Cyclohexanol, 5-methyl-2-(1-methylethyl)-, (1α,2α,5β)-
- Cyclohexanol, 5-methyl-2-(1-methylethyl)-, (1α,2α,5α)-
- Cyclohexanol, 5-methyl-2-(1-methylethyl)-, (1α,2β,5α)-
- Other names: (1S,2R,5R)-(+)-Isomenthol; (1S-(1α,2β,5beta))-5-methyl-(1-isopropyl)cyclohexan-2-ol

Phase change data

Data compiled by: Robert L. Brown and Stephen E. Stein
Quantity | Value | Units | Method | Reference | Comment |
---|---|---|---|---|---|
Tboil | 491.8 | K | N/A | Weast and Grasselli, 1989 |

References

Weast and Grasselli, 1989
CRC Handbook of Data on Organic Compounds, 2nd Editon, Weast,R.C and Grasselli, J.G., ed(s)., CRC Press, Inc., Boca Raton, FL, 1989, 1. [all data]