1H-Benz[e]indene
- Formula: C13H10
- Molecular weight: 166.2185
- IUPAC Standard InChIKey: KXYGKDBONOVZOM-UHFFFAOYSA-N
- CAS Registry Number: 232-54-2
- Chemical structure:
View 3d structure (requires JavaScript / HTML 5) - Permanent link for this species. Use this link for bookmarking this species for future reference.

Gas phase thermochemistry data

Data compiled by: Glushko Thermocenter, Russian Academy of Sciences, Moscow
Constant pressure heat capacity of gas
Cp,gas (J/mol*K) | Temperature (K) | Reference | Comment |
---|---|---|---|
39.33 | 50. | Dorofeeva O.V., 1989 | These statistically calculated values were obtained using force field approximation for polycyclic aromatic hydrocarbons to estimate the needed vibrational frequencies (see also [ Dorofeeva O.V., 1986, Moiseeva N.F., 1990]). These functions are reproduced in the reference book [ Frenkel M., 1994]. |
58.40 | 100. | ||
82.60 | 150. | ||
111.14 | 200. | ||
157.52 | 273.15 | ||
173.7 ± 1.0 | 298.15 | ||
174.85 | 300. | ||
235.64 | 400. | ||
286.54 | 500. | ||
327.36 | 600. | ||
360.09 | 700. | ||
386.70 | 800. | ||
408.65 | 900. | ||
426.96 | 1000. | ||
442.37 | 1100. | ||
455.43 | 1200. | ||
466.56 | 1300. | ||
476.09 | 1400. | ||
484.30 | 1500. |

References

Dorofeeva O.V., 1989
Dorofeeva O.V.,
Thermodynamic Properties of Gaseous Polycyclic Aromatic Hydrocarbons Containing Five-Membered Rings. Institute for High Temperatures, USSR Academy of Sciences, Preprint No.1-263 (in Russian), Moscow, 1989. [all data]
Dorofeeva O.V., 1986
Dorofeeva O.V.,
On calculation of thermodynamic properties of polycyclic aromatic hydrocarbons,
Thermochim. Acta, 1986, 102, 59-66. [all data]
Moiseeva N.F., 1990
Moiseeva N.F.,
Group additivity scheme for calculating the chemical thermodynamic properties of gaseous polycyclic aromatic hydrocarbons containing five-membered rings,
Thermochim. Acta, 1990, 168, 179-186. [all data]
Frenkel M., 1994
Frenkel M.,
Thermodynamics of Organic Compounds in the Gas State, Vol. I, II, Thermodynamics Research Center, College Station, Texas, 1994, 1994. [all data]