N-Glycyl-dl-valine
- Formula: C7H14N2O3
- Molecular weight: 174.1977
- IUPAC Standard InChIKey: STKYPAFSDFAEPH-UHFFFAOYSA-N
- CAS Registry Number: 2325-17-9
- Chemical structure:
View 3d structure (requires JavaScript / HTML 5) - Stereoisomers:

Condensed phase thermochemistry data

Data compiled by: Hussein Y. Afeefy, Joel F. Liebman, and Stephen E. Stein
Quantity | Value | Units | Method | Reference | Comment |
---|---|---|---|---|---|
ΔcH°solid | -3920. ± 0.4 | kJ/mol | Ccb | Ponomarev, Alekseeva, et al., 1962 |

References

Ponomarev, Alekseeva, et al., 1962
Ponomarev, V.V.; Alekseeva, T.A.; Akimova, L.N.,
Heats of combustion of some peptides,
Russ. J. Phys. Chem. (Engl. Transl.), 1962, 36, 457-458. [all data]