Tetra-cyclopentadiene

Condensed phase thermochemistry data

Data compiled by: Hussein Y. Afeefy, Joel F. Liebman, and Stephen E. Stein

Quantity Value Units Method Reference Comment
Δcsolid-2730.8kcal/molCcbBecker and Roth, 1934Corresponding Δfsolid = 30.0 kcal/mol (simple calculation by NIST; no Washburn corrections)

References

Becker and Roth, 1934
Becker, G.; Roth, W.A., Verbrennungswarmen einiger cyclischer kohlenwasserstoffe, Ber., 1934, 67, 627-632. [all data]