Cyclohexane, 1,1'-ethylidenebis-
- Formula: C14H26
- Molecular weight: 194.3562
- IUPAC Standard InChIKey: FUZBYNWONHYNOB-UHFFFAOYSA-N
- CAS Registry Number: 2319-61-1
- Chemical structure:
View 3d structure (requires JavaScript / HTML 5) - Other names: Ethane, 1,1-dicyclohexyl-; 1,1-Dicyclohexylethane

Condensed phase thermochemistry data

Data compiled as indicated in comments:
ALS - Hussein Y. Afeefy, Joel F. Liebman, and Stephen E. Stein
DH - Eugene S. Domalski and Elizabeth D. Hearing
Quantity | Value | Units | Method | Reference | Comment |
---|---|---|---|---|---|
ΔcH°liquid | -8347. | kJ/mol | Ccb | Serijan and Wise, 1951 | Corresponding ΔfHºliquid = -879. kJ/mol (simple calculation by NIST; no Washburn corrections); ALS |
ΔcH°liquid | -8929.1 | kJ/mol | Ccb | Wise, Serijan, et al., 1951 | Corresponding ΔfHºliquid = -296. kJ/mol (simple calculation by NIST; no Washburn corrections); ALS |
Constant pressure heat capacity of liquid
Cp,liquid (J/mol*K) | Temperature (K) | Reference | Comment |
---|---|---|---|
348.1 | 313. | Gudinowicz, Campbell, et al., 1963 | T = 313 to 483 K.; DH |

Phase change data

Data compiled as indicated in comments:
TRC - Thermodynamics Research Center, NIST Boulder Laboratories, Chris Muzny director
AC - William E. Acree, Jr., James S. Chickos

Quantity Value Units Method Reference Comment
Tboil544.32KN/ASerijan and Wise, 1951Uncertainty assigned by TRC = 0.3 K; TRC
Tboil544.32KN/AWise, Serijan, et al., 1950Uncertainty assigned by TRC = 1. K; TRC
Tboil530.KN/ASabatier and Murat, 1915Uncertainty assigned by TRC = 10. K; TRC
Tboil530.KN/ASabatier and Murat, 1912Uncertainty assigned by TRC = 10. K; TRC
Quantity Value Units Method Reference Comment
Tfus252.28KN/ASerijan and Wise, 1951, 2Uncertainty assigned by TRC = 0.3 K; TRC
Tfus252.28KN/ASerijan and Wise, 1951Uncertainty assigned by TRC = 0.2 K; TRC
Tfus252.17KN/AWise, Serijan, et al., 1950Uncertainty assigned by TRC = 0.7 K; TRC

Enthalpy of vaporization

ΔvapH (kJ/mol) Temperature (K) Method Reference Comment
62.1385.AStephenson and Malanowski, 1987Based on data from 370. - 402. K.; AC

In addition to the Thermodynamics Research Center (TRC) data available from this site, much more physical and chemical property data is available from the following TRC products:

References

Serijan and Wise, 1951
Serijan, K.T.; Wise, P.H.,
Dicyclic hydrocarbons. III. Diphenyl- and dicyclohexylalkanes through C15,
J. Am. Chem. Soc., 1951, 73, 4766-4769. [all data]
Wise, Serijan, et al., 1951
Wise, C.H.; Serijan, K.T.; Goodman, I.A.,
NACA Technical Report 1003,
NACA Technical Report 1003, 1951, 1-10. [all data]
Gudinowicz, Campbell, et al., 1963
Gudinowicz, B.J.; Campbell, R.H.; Adams, J.S.,
Specific heat measurements of complex saturated hydrocarbons,
J. Chem. Eng. Data, 1963, 8, 201-214. [all data]