3,4-Dimethoxycinnamic acid
- Formula: C11H12O4
- Molecular weight: 208.2106
- IUPAC Standard InChIKey: HJBWJAPEBGSQPR-GQCTYLIASA-N
- CAS Registry Number: 2316-26-9
- Chemical structure:
View 3d structure (requires JavaScript / HTML 5) - Species with the same structure:
- Stereoisomers:
- Other names: Dimethyl caffeic acid; 2-Propenoic acid, 3-(3,4-dimethoxyphenyl)-; Caffeic acid dimethyl ether; Cinnamic acid, 3,4-dimethoxy-; 3,4-Dimethoxyphenyl-2-propenoic acid; 3,4-Di-O-methylcaffeic acid; Methylferulic acid; O,O-Dimethylcaffeic acid; o-Methylferulic acid; NSC 4323; NSC 43569; trans-3,4-Dimethoxycinnamic acid; (2E)-3-(3,4-Dimethoxyphenyl)-2-propenoic acid

Phase change data

Data compiled by: William E. Acree, Jr., James S. Chickos
Quantity | Value | Units | Method | Reference | Comment |
---|---|---|---|---|---|
ΔsubH° | 149.9 ± 0.8 | kJ/mol | ME | Monte and Hillesheim, 1999 | Based on data from 390. to 404. K. |

Van Den Dool and Kratz RI, non-polar column, custom temperature program

Column type | Active phase | I | Reference | Comment |
---|---|---|---|---|
Capillary | VF-5MS | 1926.2 | Tret'yakov, 2008 | 30. m/0.25 mm/0.25 μm, He; Program: Multi-step temperature program; T(initial)=60C; T(final)=270C |

References

Monte and Hillesheim, 1999
Monte, Manuel J.S.; Hillesheim, Dorothea M.,
Vapour pressures, enthalpies and entropies of sublimation of trans -cinnamic acid and of nine methoxy and dimethoxycinnamic acids,
The Journal of Chemical Thermodynamics, 1999, 31, 11, 1443-1456, https://doi.org/10.1006/jcht.1999.0540
. [all data]
Santavy, et al., 1972
Santavy, F., et al.,
Coll. Czech. Chem. Comm., 1972, 37, 1825. [all data]
Tret'yakov, 2008
Tret'yakov, K.V.,
Retention Data. NIST Mass Spectrometry Data Center., NIST Mass Spectrometry Data Center, 2008. [all data]