N,N,3-trimethylbutylamine
- Formula: C7H17N
- Molecular weight: 115.2166
- IUPAC Standard InChIKey: KOOQJINBDNZUTB-UHFFFAOYSA-N
- CAS Registry Number: 2315-43-7
- Chemical structure:
View 3d structure (requires JavaScript / HTML 5) - Species with the same structure:

Phase change data

Data compiled by: Thermodynamics Research Center, NIST Boulder Laboratories, Chris Muzny director
Quantity | Value | Units | Method | Reference | Comment |
---|---|---|---|---|---|
Tboil | 386.65 | K | N/A | Clarke, 1913 | Uncertainty assigned by TRC = 3. K |
Tboil | 386.65 | K | N/A | Collie and Schryver, 1890 | Uncertainty assigned by TRC = 2. K |

References

Clarke, 1913
Clarke, H.T.,
THe Relation Between Residual Affinity and Chemical Constitution. Part IV. Some Open-chain Compounds,
J. Chem. Soc., Trans., 1913, 103, 1689. [all data]
Collie and Schryver, 1890
Collie, N.; Schryver, S.B.,
The Action of Heat on the Chlorides and Hydroxides of Mixed Quaternary Ammonium Compounds,
J. Chem. Soc., Trans., 1890, 57, 767. [all data]