1,3-Dithiol-2-one
- Formula: C3H2OS2
- Molecular weight: 118.177
- IUPAC Standard InChIKey: FWLLWHCFLMXGDG-UHFFFAOYSA-N
- CAS Registry Number: 2314-40-1
- Chemical structure:
View 3d structure (requires JavaScript / HTML 5) - Permanent link for this species. Use this link for bookmarking this species for future reference.

Gas phase thermochemistry data

Data compiled by: Hussein Y. Afeefy, Joel F. Liebman, and Stephen E. Stein
Quantity | Value | Units | Method | Reference | Comment |
---|---|---|---|---|---|
ΔfH°gas | -15.0 ± 5.1 | kJ/mol | Ccb | Rauh and Geiseler, 1973 | Reanalyzed by Cox and Pilcher, 1970, Original value = -14. ± 5.0 kJ/mol |

Condensed phase thermochemistry data

Data compiled by: Hussein Y. Afeefy, Joel F. Liebman, and Stephen E. Stein
Quantity | Value | Units | Method | Reference | Comment |
---|---|---|---|---|---|
ΔcH°solid | -2582. ± 5.0 | kJ/mol | Ccb | Rauh and Geiseler, 1973 |

Phase change data

Data compiled as indicated in comments:
AC - William E. Acree, Jr., James S. Chickos
ALS - Hussein Y. Afeefy, Joel F. Liebman, and Stephen E. Stein
Quantity | Value | Units | Method | Reference | Comment |
---|---|---|---|---|---|
ΔsubH° | 73.6 ± 0.8 | kJ/mol | N/A | Rauh and Geiseler, 1973, 2 | See also Pedley and Rylance, 1977.; AC |
ΔsubH° | 73.6 ± 0.8 | kJ/mol | V | Rauh and Geiseler, 1973 | ALS |

Gas phase ion energetics data

Data compiled as indicated in comments:
LBLHLM - Sharon G. Lias, John E. Bartmess, Joel F. Liebman, John L. Holmes, Rhoda D. Levin, and W. Gary Mallard
Ionization energy determinations
IE (eV) | Method | Reference | Comment |
---|---|---|---|
8.6 | PE | Schulz, Schweig, et al., 1983 | LBLHLM |
9.0 | PE | Schulz, Schweig, et al., 1983 | Vertical value; LBLHLM |

References

Rauh and Geiseler, 1973
Rauh, V.H.J.; Geiseler, G.,
Bildungsenthalpien und mesomerieenergien von π-bindungssystemen. 6. Mitteilung: Zur stabilität der isotrithione und isodithione,
Z. Phys. Chem. (Leipzig), 1973, 252, 395-397. [all data]
Cox and Pilcher, 1970
Cox, J.D.; Pilcher, G.,
Thermochemistry of Organic and Organometallic Compounds, Academic Press, New York, 1970, 1-636. [all data]
Rauh and Geiseler, 1973, 2
Rauh, H.-J.; Geiseler, G.,
Z. Phys. Chem. (Leipzig), 1973, 252, 395. [all data]
Pedley and Rylance, 1977
Pedley, J.B.; Rylance, J.,
, Computer Analysed Thermochemical Data: Organic and Organometallic Compounds, University of Sussex, Brighton, 1977. [all data]