Flurenol butyl ester
- Formula: C18H18O3
- Molecular weight: 282.3337
- IUPAC Standard InChIKey: PSGPXWYGJGGEEG-UHFFFAOYSA-N
- CAS Registry Number: 2314-09-2
- Chemical structure:
View 3d structure (requires JavaScript / HTML 5) - Other names: 9H-Fluorene-9-carboxylic acid, 9-hydroxy-, butyl ester; Fluorene-9-carboxylic acid, 9-hydroxy-, butyl ester; Butyl morphactin; Butyl 9-hydroxy-9-fluorenecarboxylate; Butyl 9-hydroxyfluorene-9-carboxylate; Butyl 9-hydroxyfluorenyl-9-carboxylate; Butyl ester of 9-hydroxyfluorene-9-carboxylic acid; EMD 7311 W; Flurecol-Butyl; Flurenol ester; IT 3233; Morphactin IT 3233; TH 407-H; Flurenol-n-butyl ester; 9-Hydroxyfluorene-9-Carboxylic acid butyl ester; 9-Hydroxyfluorene-9-carboxylic acid n-butyl ester; Flurenol-butyl; Butyl flurenol; butyl 9-hydroxy-9H-fluorene-9-carboxylate

Phase change data

Data compiled by: Thermodynamics Research Center, NIST Boulder Laboratories, Chris Muzny director
Quantity | Value | Units | Method | Reference | Comment |
---|---|---|---|---|---|
Tfus | 344.68 | K | N/A | Donnelly, Drewes, et al., 1990 | Uncertainty assigned by TRC = 0.2 K |

References

Donnelly, Drewes, et al., 1990
Donnelly, J.R.; Drewes, L.A.; Johnson, R.L.; Munslow, W.D.; Knapp, K.K.; Sovocool, G.W.,
Purity and heat of fusion data for environmental standards as determined by differential scanning calorimetry,
Thermochim. Acta, 1990, 167, 2, 155, https://doi.org/10.1016/0040-6031(90)80476-F
. [all data]