2-bromo-2-chloropropane
- Formula: C3H6BrCl
- Molecular weight: 157.437
- IUPAC Standard InChIKey: YSQXISYCKHFJFJ-UHFFFAOYSA-N
- CAS Registry Number: 2310-98-7
- Chemical structure:
View 3d structure (requires JavaScript / HTML 5) - Other names: Propane, 2-bromo-2-chloro-

Phase change data

Data compiled by: Robert L. Brown and Stephen E. Stein
Quantity | Value | Units | Method | Reference | Comment |
---|---|---|---|---|---|
Tboil | 363.6 to 364.6 | K | N/A | Buckingham and Donaghy, 1982 |

Reaction thermochemistry data

Data compiled by: Hussein Y. Afeefy, Joel F. Liebman, and Stephen E. Stein
Individual Reactions
By formula: C3H6BrCl = HBr + C3H5Cl
Quantity | Value | Units | Method | Reference | Comment |
---|---|---|---|---|---|
ΔrH° | 66.2 | kJ/mol | Eqk | Levanova, Rodova, et al., 1983 | liquid phase; Flow reactor |
By formula: 2C3H6BrCl = C3H6Br2 + C3H6Cl2
Quantity | Value | Units | Method | Reference | Comment |
---|---|---|---|---|---|
ΔrH° | -1.3 | kJ/mol | Eqk | Levanova, Rodova, et al., 1983 | liquid phase; Flow reactor |
By formula: C3H6BrCl = C3H5Br + HCl
Quantity | Value | Units | Method | Reference | Comment |
---|---|---|---|---|---|
ΔrH° | 62.6 | kJ/mol | Eqk | Levanova, Rodova, et al., 1983 | liquid phase; Flow reactor |

References

Buckingham and Donaghy, 1982
Buckingham, J.; Donaghy, S.M.,
Dictionary of Organic Compounds: Fifth Edition, Chapman and Hall, New York, 1982, 1. [all data]
Levanova, Rodova, et al., 1983
Levanova, S.V.; Rodova, R.M.; Tereshkina, T.P.; Zabrodina, T.I.,
Thermocatalytic reactions of bromochloropropanes,
Russ. J. Phys. Chem. (Engl. Transl.), 1983, 57, 1142-1146. [all data]