Pirimicarb

Kovats' RI, non-polar column, custom temperature program

Data compiled by: NIST Mass Spectrometry Data Center, William E. Wallace, director

Column type CapillaryPacked
Active phase HP-5SE-30
Column length (m) 30.2.
Carrier gas  N2
Substrate  Chromosorb W HP
Column diameter (mm) 0.32
Phase thickness (μm) 0.25
Program 50C(1min) => 20C/min => 150C => 10C/min => 280C(4min)not specified
I 1837.1816.
ReferenceTanabe, Mitobe, et al., 2000Osselton and Snelling, 1986
Comment MSDC-RI MSDC-RI

Kovats' RI, non-polar column, isothermal

Data compiled by: NIST Mass Spectrometry Data Center, William E. Wallace, director

Column type CapillaryCapillaryCapillary
Active phase OV-1OV-1OV-1
Column length (m)
Carrier gas
Substrate
Column diameter (mm)
Phase thickness (μm)
Temperature (C) 160.190.220.
I 1796.1807.1810.
ReferenceErdmann, Rochholz, et al., 1992Erdmann, Rochholz, et al., 1992Erdmann, Rochholz, et al., 1992
Comment MSDC-RI MSDC-RI MSDC-RI

References

Tanabe, Mitobe, et al., 2000
Tanabe, A.; Mitobe, H.; Kawata, K.; Sakai, M.; Yasuhara, A., New monitoring system for ninety pesticides and related compounds in river water by solid-phase extraction with determination by gas chromatography/mass spectrometry, J. AOAC Int., 2000, 83, 1, 61-77. [all data]

Osselton and Snelling, 1986
Osselton, M.D.; Snelling, R.D., Chromatographic Identification of Pesticides, J. Chromatogr., 1986, 368, 265-271, https://doi.org/10.1016/S0021-9673(00)91068-9 . [all data]